program: Orca
programVersion: 6.1.x
elementType: N O C C H C H H H H H H C C O Li O O C H H H C H H H C H H H C H H H C C C C H C H C H H N C C H H H H H H
keywords: opt freq wb97x-d3bj def2-svp def2/J tightscf tightopt
charge: 0
multiplicity: 1
frequency: 0.00 0.00 0.00 0.00 0.00 0.00 -65.05 18.07 32.60 32.86 38.84 46.71 51.30 63.33 64.24 74.27 82.59 83.58 90.16 104.58 108.23 120.25 131.84 135.52 150.35 159.97 187.43 191.37 193.85 210.85 226.92 229.88 240.27 245.88 252.41 275.76 282.93 288.57 314.71 324.92 362.67 392.38 396.01 428.58 431.36 436.45 469.23 490.59 500.08 517.85 537.69 544.50 570.38 618.61 630.54 636.13 659.09 751.88 766.16 789.58 841.45 843.60 861.40 963.33 972.72 974.48 990.91 993.92 1006.40 1018.07 1038.34 1040.17 1081.55 1088.19 1127.35 1128.35 1130.15 1140.23 1148.60 1157.27 1160.62 1164.93 1175.49 1197.70 1201.55 1201.75 1211.84 1219.63 1220.95 1223.63 1265.68 1271.92 1278.67 1282.24 1289.86 1310.14 1333.07 1372.14 1380.87 1399.11 1406.21 1420.64 1426.12 1436.94 1441.57 1442.84 1450.62 1452.87 1454.12 1455.35 1458.25 1458.63 1460.82 1461.48 1462.91 1463.91 1469.00 1469.92 1471.87 1476.01 1477.57 1478.87 1492.70 1499.08 1501.01 1503.65 1585.68 1649.17 1718.93 2125.85 2995.41 3019.52 3028.34 3035.21 3039.98 3042.19 3047.12 3062.85 3101.72 3107.25 3108.22 3108.51 3119.74 3123.67 3126.26 3130.70 3148.03 3155.02 3174.56 3180.05 3184.12 3187.84 3188.04 3189.26 3196.14 3200.12 3218.91 3248.70 3249.57
frequency: 18.07 32.60 32.86 38.84 46.71 51.30 63.33 64.24 74.27 82.59 83.58 90.16 104.58 108.23 120.25 131.84 135.52 150.35 159.97 187.43 191.37 193.85 210.85 226.92 229.88 240.27 245.88 252.41 275.76 282.93 288.57 314.71 324.92 362.67 392.38 396.01 428.58 431.36 436.45 469.23 490.59 500.08 517.85 537.69 544.50 570.38 618.61 630.54 636.13 659.09 751.88 766.16 789.58 841.45 843.60 861.40 963.33 972.72 974.48 990.91 993.92 1006.40 1018.07 1038.34 1040.17 1081.55 1088.19 1127.35 1128.35 1130.15 1140.23 1148.60 1157.27 1160.62 1164.93 1175.49 1197.70 1201.55 1201.75 1211.84 1219.63 1220.95 1223.63 1265.68 1271.92 1278.67 1282.24 1289.86 1310.14 1333.07 1372.14 1380.87 1399.11 1406.21 1420.64 1426.12 1436.94 1441.57 1442.84 1450.62 1452.87 1454.12 1455.35 1458.25 1458.63 1460.82 1461.48 1462.91 1463.91 1469.00 1469.92 1471.87 1476.01 1477.57 1478.87 1492.70 1499.08 1501.01 1503.65 1585.68 1649.17 1718.93 2125.85 2995.41 3019.52 3028.34 3035.21 3039.98 3042.19 3047.12 3062.85 3101.72 3107.25 3108.22 3108.51 3119.74 3123.67 3126.26 3130.70 3148.03 3155.02 3174.56 3180.05 3184.12 3187.84 3188.04 3189.26 3196.14 3200.12 3218.91 3248.70 3249.57
formula: C17H29LiN2O4
InChI: InChI=1/C13H17N2O2.2C2H6O.Li/c1-10(15(4)17)13(9-16)11-5-7-12(8-6-11)14(2)3;2*1-3-2;/h5-8,10H,1-4H3;2*1-2H3;/q-2;;;+2/rC17H29LiN2O4/c1-14-17(15-9-11-16(12-10-15)19(2)3)13-21-18(23(5)6,24(7)8)22-20(14)4/h9-12,14H,1-8H3
53 atoms
N  1.491101 1.769859 -1.476169
O  2.418611 1.303257 -0.553965
C  0.292449 2.135606 -0.74265
C  1.236993 0.742707 -2.46927
H  -0.509077 2.30652 -1.479062
C  0.511408 3.418232 0.056004
H  2.174831 0.527054 -3.005444
H  0.870544 -0.205019 -2.020932
H  0.492701 1.098529 -3.201042
H  0.787534 4.24464 -0.619185
H  -0.401288 3.701089 0.604174
H  1.325544 3.271461 0.781432
C  0.686256 0.352987 0.937253
C  -0.185524 0.984704 0.169897
O  1.467823 -0.213358 1.625201
Li 2.948642 -0.314735 0.02698
O  2.612639 -2.08549 -0.686265
O  4.778527 -0.351872 0.58485
C  1.430678 -2.844635 -0.507359
H  0.679377 -2.59607 -1.278703
H  1.652751 -3.925521 -0.557326
H  1.028591 -2.608261 0.486387
C  3.298021 -2.379626 -1.890128
H  2.640999 -2.235064 -2.766016
H  4.155537 -1.69576 -1.967105
H  3.666268 -3.421193 -1.884579
C  5.569252 -1.482406 0.892261
H  6.000629 -1.397119 1.906029
H  4.920003 -2.367779 0.849447
H  6.390707 -1.598366 0.161775
C  5.482515 0.87828 0.611881
H  6.32424 0.861766 -0.104177
H  4.767873 1.661046 0.320715
H  5.875077 1.081494 1.62453
C  -1.620914 0.58923 0.232945
C  -2.647424 1.499221 -0.0633
C  -2.016624 -0.708693 0.599026
C  -3.993174 1.139995 -0.000726
H  -2.401718 2.528228 -0.339814
C  -3.355578 -1.081596 0.677452
H  -1.254197 -1.462403 0.823914
C  -4.389208 -0.166551 0.366249
H  -3.59223 -2.104937 0.971571
H  -4.741007 1.897311 -0.239256
N  -5.721754 -0.534514 0.415491
C  -6.745168 0.479201 0.26516
C  -6.085715 -1.816766 0.981983
H  -7.733492 0.002648 0.307862
H  -6.70137 1.252518 1.057025
H  -6.666519 0.99081 -0.708909
H  -7.176009 -1.936409 0.931461
H  -5.635236 -2.651296 0.418312
H  -5.77774 -1.919503 2.040964
totalener: -1082.75428745203021 hartree
nucrepener: 2116.18437858304560 hartree
electener: -3198.90837341873521 hartree
oneelecener: -5680.44657701931101 hartree
twoeener: 2481.53820360057580 hartree
cpcmener: -0.02702625610631 hartree
kineticenergy: 1069.99129295418379 hartree
exchangeener: -98.021534226831 hartree
dispersion: -0.108824261 hartree
dispersion: -0.108485388 hartree
dispersion: -0.108373057 hartree
dispersion: -0.108305999 hartree
dispersion: -0.108226521 hartree
dispersion: -0.108198352 hartree
dispersion: -0.108154442 hartree
dispersion: -0.108094094 hartree
dispersion: -0.107981160 hartree
dispersion: -0.107816541 hartree
dispersion: -0.107703575 hartree
dispersion: -0.107587140 hartree
dispersion: -0.107481294 hartree
dispersion: -0.107453341 hartree
dispersion: -0.107457113 hartree
dispersion: -0.107545746 hartree
dispersion: -0.107584572 hartree
dispersion: -0.107703638 hartree
dispersion: -0.107695786 hartree
dispersion: -0.107722310 hartree
dispersion: -0.107741635 hartree
dispersion: -0.107747940 hartree
dispersion: -0.107746481 hartree
dispersion: -0.107739907 hartree
dispersion: -0.107731678 hartree
dispersion: -0.107718080 hartree
dispersion: -0.107705635 hartree
dispersion: -0.107709050 hartree
dispersion: -0.107717766 hartree
dispersion: -0.107726746 hartree
dispersion: -0.107735131 hartree
dispersion: -0.107725604 hartree
dispersion: -0.107718472 hartree
dispersion: -0.107719961 hartree
dispersion: -0.107714889 hartree
dispersion: -0.107724611 hartree
dispersion: -0.107732960 hartree
dispersion: -0.107749332 hartree
dispersion: -0.107768747 hartree
dispersion: -0.107789655 hartree
dispersion: -0.107803613 hartree
dispersion: -0.107806700 hartree
dispersion: -0.107810338 hartree
dispersion: -0.107799125 hartree
dispersion: -0.107794035 hartree
dispersion: -0.107785108 hartree
dispersion: -0.107778651 hartree
dispersion: -0.107772936 hartree
elementType: N O C H Li
energy: -524.2581 -523.8414 -523.7467 -520.6920 -392.7062 -392.4249 -282.9352 -281.1959 -281.1636 -281.1357 -280.9798 -280.9218 -280.4751 -280.4687 -280.4513 -280.1073 -279.8802 -279.8406 -279.8386 -279.7695 -279.6914 -279.6669 -279.2118 -54.6928 -32.9824 -31.9746 -31.8582 -30.1054 -29.1053 -26.6883 -25.3704 -24.2549 -23.6793 -23.3521 -23.2337 -23.1099 -22.7912 -22.6463 -20.9444 -20.7140 -20.5752 -20.5026 -19.6467 -18.7599 -18.4384 -17.5522 -16.9012 -16.5705 -16.4232 -16.3304 -16.2783 -16.2147 -16.1270 -16.1000 -15.9784 -15.5863 -15.4452 -15.3454 -15.2850 -14.9326 -14.5834 -14.3739 -14.2707 -14.1552 -13.8281 -13.7931 -13.6862 -13.6675 -13.4627 -13.3287 -13.2640 -13.2020 -12.9981 -12.8893 -12.8546 -12.3743 -12.2642 -12.1801 -12.0888 -11.9283 -11.6446 -10.8259 -10.5054 -10.3998 -10.3610 -9.4268 -8.8818 -8.5779 -7.0957 -6.8428 1.5622 1.7425 2.0094 2.3311 4.0235 4.0467 4.1998 4.3357 4.4242 4.6074 4.8036 electronvolt
chargesum: 0.0000000
charge: -0.157767 -0.864393 0.141104 0.143197 0.008830 0.082824 0.025077 0.011862 0.013820 0.012997 0.014179 0.029206 0.332968 -0.274412 -0.370459 0.894921 -0.873561 -0.888327 0.238676 0.051232 0.043402 0.079329 0.253873 0.048188 0.073244 0.048273 0.277573 0.044336 0.070147 0.044277 0.261287 0.042686 0.084264 0.043266 0.064365 -0.072941 -0.055716 -0.120128 0.024224 -0.118787 0.008135 0.215138 0.007076 0.007544 -0.401545 0.114747 0.115481 0.044321 0.027838 0.041440 0.044416 0.040597 0.027674
charge: 0.045715 -0.817386 0.061579 0.036246 0.027483 -0.040645 0.028665 0.018693 0.018864 0.021715 0.021922 0.037601 0.359176 -0.132898 -0.337289 0.337968 -0.573547 -0.558552 0.195415 0.045297 0.047136 0.067668 0.196258 0.046724 0.069868 0.047704 0.193974 0.046040 0.066786 0.045548 0.197436 0.044354 0.078814 0.044485 -0.046929 -0.029869 -0.028962 -0.083611 0.035364 -0.082286 0.036776 0.025153 0.033978 0.033816 -0.087729 0.031764 0.031722 0.031864 0.015601 0.023622 0.032051 0.023166 0.015690
qa: -0.1578 -0.8644 0.1411 0.1432 0.0088 0.0828 0.0251 0.0119 0.0138 0.0130 0.0142 0.0292 0.3330 -0.2744 -0.3705 0.8949 -0.8736 -0.8883 0.2387 0.0512 0.0434 0.0793 0.2539 0.0482 0.0732 0.0483 0.2776 0.0443 0.0701 0.0443 0.2613 0.0427 0.0843 0.0433 0.0644 -0.0729 -0.0557 -0.1201 0.0242 -0.1188 0.0081 0.2151 0.0071 0.0075 -0.4015 0.1147 0.1155 0.0443 0.0278 0.0414 0.0444 0.0406 0.0277
va: 3.1490 1.2506 3.9863 3.9042 0.9932 3.9133 0.9850 1.0042 0.9909 1.0018 0.9941 1.0083 3.9030 3.8271 2.0265 0.2576 2.0663 2.0730 3.8333 0.9844 0.9837 0.9882 3.8330 0.9835 0.9897 0.9804 3.8417 0.9807 0.9866 0.9789 3.8386 0.9786 0.9931 0.9795 3.7880 3.8921 3.8699 3.8780 0.9906 3.8791 1.0009 3.7635 0.9983 0.9985 3.2158 3.9321 3.9320 0.9960 0.9858 0.9848 0.9962 0.9844 0.9860
dispersion: -0.107770083 hartree
energy: -1082.867558872229 hartree
dipole: -0.756952409 0.634489362 -0.122463047 -6.632482275 3.619378849 -3.013103426 -6.102873201 5.850054265 -0.252818936
dipolemethod: SCF
magnitude: 3.026170330 au
magnitude: 7.691913692 debye
temp: 298.15 k
press: 1.00 atm
zeropoint: 0.44989866 hartree
thermalvibcorrection: 0.02679445 hartree
thermalrotcorrection: 0.00141627 hartree
thermaltrasncorrection: 0.00141627 hartree
thermaltotal: -1082.38803322 hartree
thermalcorr: 0.02962699 hartree
nonthermalcorr: 0.44989866 hartree
totalcorr: 0.47952565 hartree
thermalcorrenthalpy: 0.00094421 hartree
totalenthalpy: -1082.38708901 hartree
vibrat: 0.04929357 hartree
rotat: 0.01685685 hartree
transl: 0.02057230 hartree
total: 0.08672271 hartree
totalentropycorr: -0.08672271 hartree
gibbsenthalpy: -1082.47381172 hartree
gibbsminuselec: 0.39374715 hartree
