program: Orca
programVersion: 6.1.x
elementType: N O C C H C H H H H H H C C O Li O O C H H H C H H H C H H H C H H H C C C C H C H C N O O F F
keywords: freq wb97x-d3bj def2-svp def2/J tightscf
charge: 0
multiplicity: 1
frequency: 0.00 0.00 0.00 0.00 0.00 0.00 -181.49 5.67 16.27 21.87 25.65 38.44 44.44 61.43 67.83 69.17 77.73 82.40 86.56 94.52 111.12 123.32 132.05 142.26 151.58 176.12 196.73 199.16 202.90 224.84 227.63 239.27 241.89 244.16 255.58 260.64 274.77 280.10 292.50 312.75 339.47 392.69 396.65 407.57 431.92 461.80 482.47 503.29 530.57 535.00 555.25 557.36 600.13 605.28 623.92 633.77 634.88 703.15 721.29 751.15 811.38 827.37 861.84 882.64 893.69 901.40 962.98 972.20 1021.85 1043.56 1058.57 1085.64 1109.88 1126.94 1128.68 1129.56 1156.63 1172.82 1175.62 1192.54 1208.84 1210.57 1211.93 1217.20 1221.42 1226.53 1249.95 1278.39 1280.00 1282.54 1316.20 1342.72 1363.43 1384.03 1413.41 1425.13 1435.48 1444.34 1447.48 1450.62 1454.05 1457.04 1459.11 1462.07 1463.54 1464.18 1465.80 1469.11 1472.91 1474.79 1477.75 1491.41 1499.07 1500.75 1509.40 1551.71 1656.33 1702.96 1708.06 2090.01 3005.12 3039.24 3042.52 3045.68 3049.28 3065.44 3111.90 3120.91 3124.89 3127.77 3131.29 3133.88 3155.56 3159.33 3176.30 3187.07 3190.73 3190.88 3193.88 3234.60 3267.41
frequency: 5.67 16.27 21.87 25.65 38.44 44.44 61.43 67.83 69.17 77.73 82.40 86.56 94.52 111.12 123.32 132.05 142.26 151.58 176.12 196.73 199.16 202.90 224.84 227.63 239.27 241.89 244.16 255.58 260.64 274.77 280.10 292.50 312.75 339.47 392.69 396.65 407.57 431.92 461.80 482.47 503.29 530.57 535.00 555.25 557.36 600.13 605.28 623.92 633.77 634.88 703.15 721.29 751.15 811.38 827.37 861.84 882.64 893.69 901.40 962.98 972.20 1021.85 1043.56 1058.57 1085.64 1109.88 1126.94 1128.68 1129.56 1156.63 1172.82 1175.62 1192.54 1208.84 1210.57 1211.93 1217.20 1221.42 1226.53 1249.95 1278.39 1280.00 1282.54 1316.20 1342.72 1363.43 1384.03 1413.41 1425.13 1435.48 1444.34 1447.48 1450.62 1454.05 1457.04 1459.11 1462.07 1463.54 1464.18 1465.80 1469.11 1472.91 1474.79 1477.75 1491.41 1499.07 1500.75 1509.40 1551.71 1656.33 1702.96 1708.06 2090.01 3005.12 3039.24 3042.52 3045.68 3049.28 3065.44 3111.90 3120.91 3124.89 3127.77 3131.29 3133.88 3155.56 3159.33 3176.30 3187.07 3190.73 3190.88 3193.88 3234.60 3267.41
formula: C15H21F2LiN2O6
InChI: InChI=1/C11H9F2N2O4.2C2H6O.Li/c1-6(14(2)17)8(5-16)7-3-9(12)11(15(18)19)10(13)4-7;2*1-3-2;/h3-4,6H,1-2H3;2*1-2H3;/q-2;;;+2/rC15H21F2LiN2O6/c1-10-12(11-7-13(16)15(20(21)22)14(17)8-11)9-23-18(25(3)4,26(5)6)24-19(10)2/h7-8,10H,1-6H3
47 atoms
N  1.782268 2.099528 -0.880991
O  2.506135 1.426707 0.088535
C  0.437717 2.209154 -0.352904
C  1.828786 1.358865 -2.130233
H  -0.234544 2.454808 -1.18921
C  0.337825 3.307281 0.703441
H  2.876188 1.291098 -2.463618
H  1.42892 0.328142 -2.032051
H  1.253164 1.891593 -2.904401
H  0.595655 4.283433 0.262167
H  -0.683013 3.366123 1.113281
H  1.035125 3.096391 1.527904
C  0.85997 0.08003 0.903091
C  -0.005449 0.851469 0.231213
O  1.621743 -0.599014 1.494498
Li 3.353797 -0.167758 0.162034
O  3.392668 -1.625418 -1.085913
O  5.002599 -0.205545 1.12056
C  2.293249 -2.439384 -1.454834
H  1.901382 -2.146399 -2.444931
H  2.591064 -3.502609 -1.486348
H  1.505358 -2.308924 -0.700821
C  4.464313 -1.670771 -2.011746
H  4.129333 -1.352037 -3.014775
H  5.247578 -0.984999 -1.659183
H  4.88086 -2.691596 -2.078347
C  5.852239 -1.316745 1.333387
H  5.964592 -1.522406 2.413016
H  5.394486 -2.189069 0.846791
H  6.850809 -1.13721 0.895571
C  5.458035 0.996394 1.720426
H  6.442998 1.286821 1.312529
H  4.717641 1.774236 1.48716
H  5.540891 0.878063 2.815646
C  -1.404556 0.406652 0.171829
C  -2.408848 1.237892 -0.364015
C  -1.784844 -0.870004 0.648579
C  -3.720288 0.799827 -0.429045
H  -2.201339 2.244151 -0.727181
C  -3.100942 -1.278372 0.593336
H  -1.058964 -1.574592 1.061464
C  -4.102824 -0.460001 0.047072
N  -5.483272 -0.905545 -0.021348
O  -5.931977 -1.512195 0.933353
O  -6.114311 -0.648589 -1.0297
F  -4.64428 1.621055 -0.921402
F  -3.416779 -2.495938 1.02821
elementType: N O C H Li F
totalener: -1351.52925902476682 hartree
nucrepener: 2387.24279833874562 hartree
electener: -3738.74191832979159 hartree
oneelecener: -6595.09643836539180 hartree
twoeener: 2856.35452003560022 hartree
cpcmener: -0.02898137298825 hartree
kineticenergy: 1338.02362197422553 hartree
exchangeener: -115.472219400430 hartree
energy: -674.9598 -674.9587 -524.6054 -524.3587 -524.3548 -523.9951 -523.8964 -521.2008 -399.6335 -392.7402 -283.5874 -283.2884 -283.2804 -281.8135 -281.5276 -281.3074 -281.2875 -281.2397 -281.1132 -280.7186 -280.4822 -280.4251 -280.2981 -279.9635 -279.3850 -54.9951 -37.7176 -37.2338 -37.1792 -33.4285 -32.6646 -32.1104 -31.9890 -30.6210 -28.1796 -26.5540 -25.3211 -24.5789 -24.4073 -23.3589 -23.3397 -23.2189 -22.3676 -21.1427 -20.8365 -20.7321 -20.6977 -20.3878 -19.3148 -19.0103 -18.6699 -18.5855 -17.8653 -17.2976 -17.2619 -17.0653 -16.9108 -16.8135 -16.7027 -16.4844 -16.4532 -16.4074 -16.3173 -16.2393 -16.1213 -15.8829 -15.7306 -15.6394 -15.3805 -15.0352 -14.6169 -14.2676 -13.9973 -13.9262 -13.8787 -13.7969 -13.7372 -13.5223 -13.4087 -13.3118 -13.1629 -12.7129 -12.4755 -12.3404 -12.3066 -12.1245 -11.8946 -11.7198 -11.7168 -10.8158 -10.7387 -10.6284 -10.5259 -9.8438 -9.1173 -8.2551 -7.2337 -0.4092 1.4257 1.4941 1.5804 1.7216 3.8506 3.8949 4.0044 4.1686 4.2907 4.3989 electronvolt
chargesum: -0.0000000
charge: -0.154385 -0.834318 0.148180 0.143971 0.021669 0.095791 0.035447 0.009621 0.022148 0.020786 0.016338 0.028345 0.344079 -0.300742 -0.325455 0.943409 -0.894689 -0.930169 0.255316 0.053325 0.049396 0.059271 0.253651 0.049444 0.071081 0.051505 0.289761 0.047647 0.068015 0.048989 0.263657 0.047149 0.080875 0.047948 0.180715 -0.172808 -0.142574 0.328528 0.048088 0.330269 0.039135 -0.073020 0.283432 -0.305509 -0.305921 -0.168372 -0.169019
charge: 0.051631 -0.784649 0.060970 0.038825 0.031083 -0.039274 0.035320 0.020351 0.022239 0.024639 0.024362 0.038138 0.391963 -0.141091 -0.313152 0.358688 -0.573885 -0.562190 0.196786 0.047002 0.048509 0.066498 0.196715 0.048347 0.069448 0.049046 0.194772 0.047583 0.066353 0.047058 0.198083 0.045943 0.076340 0.046529 0.055319 -0.075704 -0.071257 0.136130 0.054403 0.133269 0.059194 -0.050509 0.474618 -0.397874 -0.397914 -0.023994 -0.024661
qa: -0.1544 -0.8343 0.1482 0.1440 0.0217 0.0958 0.0354 0.0096 0.0221 0.0208 0.0163 0.0283 0.3441 -0.3007 -0.3255 0.9434 -0.8947 -0.9302 0.2553 0.0533 0.0494 0.0593 0.2537 0.0494 0.0711 0.0515 0.2898 0.0476 0.0680 0.0490 0.2637 0.0471 0.0809 0.0479 0.1807 -0.1728 -0.1426 0.3285 0.0481 0.3303 0.0391 -0.0730 0.2834 -0.3055 -0.3059 -0.1684 -0.1690
va: 3.1352 1.4022 3.9616 3.9092 0.9898 3.9146 0.9848 1.0048 0.9900 1.0006 0.9935 1.0092 3.9564 3.8784 2.0809 0.1731 2.0785 2.1147 3.8360 0.9819 0.9823 0.9960 3.8415 0.9831 0.9895 0.9805 3.8375 0.9808 0.9876 0.9784 3.8419 0.9789 0.9958 0.9795 3.7391 3.8431 3.7925 3.9727 1.0093 3.9828 1.0152 3.5699 3.8768 1.8086 1.8082 1.2118 1.2109
dispersion: -0.099123097 hartree
energy: -1351.628382122209 hartree
dipole: 61.624938685 -56.059850824 5.565087861 4.629957628 -5.971091360 -1.341133732 -6.904155733 6.041066363 -0.863089371
dipolemethod: SCF
magnitude: 5.789107517 au
magnitude: 14.714741909 debye
temp: 298.15 k
press: 1.00 atm
zeropoint: 0.36304581 hartree
thermalvibcorrection: 0.02684944 hartree
thermalrotcorrection: 0.00141627 hartree
thermaltrasncorrection: 0.00141627 hartree
thermaltotal: -1351.23565432 hartree
thermalcorr: 0.02968199 hartree
nonthermalcorr: 0.36304581 hartree
totalcorr: 0.39272780 hartree
thermalcorrenthalpy: 0.00094421 hartree
totalenthalpy: -1351.23471012 hartree
vibrat: 0.05046875 hartree
rotat: 0.01708011 hartree
transl: 0.02072526 hartree
total: 0.08827412 hartree
totalentropycorr: -0.08827412 hartree
gibbsenthalpy: -1351.32298424 hartree
gibbsminuselec: 0.30539788 hartree
