program: Orca
programVersion: 6.1.x
elementType: Au C C C C H C H H C P C C H C H H H H H H H H H H H H C C C C H C H C N O O C N C N
elementType: Au
keywords: irc wb97x-d3bj def2-svp def2/J defgrid1 tightscf
charge: 1
multiplicity: 1
formula: C17H18AuN3O2P
InChI: InChI=1/C14H9N3O2.C3H9P.Au/c1-3-4-5-10(2)11-6-12(8-15)14(17(18)19)13(7-11)9-16;1-4(2)3;/h1,6-7H,2,4-5H2;1-3H3;/rC17H18AuN3O2P/c1-12(6-7-13(2)18-24(3,4)5)14-8-15(10-19)17(21(22)23)16(9-14)11-20/h2,8-9H,1,6-7H2,3-5H3
42 atoms
Au -0.076901 -2.609316 0.147656
C  1.217499 -0.48604 1.351595
C  0.00317 -0.859666 1.305741
C  0.466166 1.568566 2.383551
C  1.687645 1.074871 2.715957
H  1.786362 0.395396 3.555629
C  -1.195791 -0.191599 1.872306
H  -1.881056 -0.905332 2.350169
H  -1.744579 0.277719 1.040316
C  -0.748182 0.891227 2.906576
P  -0.267926 -4.523613 -1.110619
C  0.02126 -4.251631 -2.883046
C  0.897292 -5.830002 -0.626151
H  2.231726 -0.580096 1.002309
C  -1.914545 -5.282241 -1.001337
H  -2.672831 -4.566723 -1.353021
H  -1.953445 -6.191613 -1.621042
H  -2.13001 -5.542976 0.045717
H  -0.703299 -3.516928 -3.26496
H  -0.091774 -5.198419 -3.433974
H  1.038249 -3.859492 -3.033497
H  1.928498 -5.464022 -0.741518
H  0.751101 -6.719257 -1.259016
H  0.730873 -6.098825 0.427702
H  2.59944 1.510151 2.31983
H  -1.584957 1.585097 3.059508
H  -0.514619 0.398082 3.858736
C  0.317299 2.642533 1.364673
C  -0.683221 3.608659 1.505552
C  1.169746 2.70431 0.256733
C  -0.821091 4.641377 0.569572
H  -1.362527 3.588244 2.358955
C  1.025049 3.709312 -0.705725
H  1.952038 1.957627 0.112972
C  0.030529 4.679767 -0.538647
N  -0.126137 5.746113 -1.543533
O  0.059494 5.445325 -2.70089
O  -0.430094 6.845234 -1.139408
C  -1.873769 5.608816 0.783202
N  -2.747176 6.327819 1.019869
C  1.935362 3.702053 -1.828515
N  2.711713 3.630509 -2.681775
elementType: Au C H P N O
totalener: -1449.83902495504390 hartree
nucrepener: 2193.23318057002189 hartree
electener: -3642.96298955609973 hartree
oneelecener: -6364.32753747690367 hartree
twoeener: 2721.36454792080394 hartree
cpcmener: -0.10847695929897 hartree
kineticenergy: 1349.11585616556158 hartree
exchangeener: -112.254391060111 hartree
energy: -2098.6467 -524.8869 -524.8843 -400.1156 -393.3635 -393.3491 -283.1998 -282.6934 -282.6905 -282.0425 -282.0249 -281.9854 -281.9046 -281.8899 -281.7457 -281.6404 -281.1145 -280.8468 -280.7748 -280.6707 -280.4058 -280.4036 -280.4012 -182.7681 -132.6317 -132.6316 -132.5940 -116.8583 -67.6296 -67.1329 -67.1179 -38.3039 -33.3782 -29.6257 -28.9633 -28.6797 -27.9990 -26.6813 -26.3154 -25.5242 -25.3103 -24.4592 -23.8559 -22.8046 -22.8034 -22.5153 -21.5978 -21.5154 -20.6873 -19.4056 -19.3288 -18.9381 -18.7618 -18.3742 -18.0041 -17.6952 -17.5985 -17.3106 -16.6206 -16.1627 -16.0686 -15.6249 -15.6015 -15.4427 -15.3078 -15.2956 -14.8881 -14.6233 -14.4228 -14.4188 -14.1745 -13.9718 -13.9342 -13.8892 -13.8438 -13.5814 -13.4132 -13.2589 -13.2082 -13.0948 -12.9467 -12.8835 -12.4010 -12.3061 -12.2662 -12.0650 -12.0521 -11.7807 -11.7500 -11.7016 -11.1872 -10.8547 -10.6756 -10.2874 -9.8221 -1.4723 -0.5739 -0.2563 0.7357 0.9750 1.2828 1.8206 2.2994 2.5016 2.6848 2.9484 electronvolt
chargesum: 1.0000000
charge: 0.117516 -0.117674 -0.289676 -0.161872 -0.271492 0.121843 0.169064 0.068986 0.070881 0.204505 0.089096 -0.134276 -0.133761 0.234819 -0.130574 0.092385 0.081637 0.091988 0.092597 0.082142 0.091937 0.092905 0.081761 0.091716 0.167054 0.062105 0.053643 0.126804 0.055296 0.036491 -0.167420 0.071855 -0.161283 0.074022 0.322499 0.232419 -0.229539 -0.228212 -0.057325 0.030338 -0.058637 0.033441
charge: 0.015605 -0.110780 -0.571148 -0.532631 -0.280353 0.208256 0.268948 0.078368 0.085976 0.254526 0.770735 -0.172581 -0.172599 0.225420 -0.172329 0.052158 0.044406 0.052077 0.052170 0.044386 0.051819 0.051856 0.044403 0.051941 0.200267 0.073827 0.079922 0.231441 0.095333 0.102317 -0.042612 0.073679 -0.043410 0.078591 0.040198 0.292402 -0.183079 -0.181660 0.004110 -0.082603 0.004181 -0.083533
qa: 0.1175 -0.1177 -0.2897 -0.1619 -0.2715 0.1218 0.1691 0.0690 0.0709 0.2045 0.0891 -0.1343 -0.1338 0.2348 -0.1306 0.0924 0.0816 0.0920 0.0926 0.0821 0.0919 0.0929 0.0818 0.0917 0.1671 0.0621 0.0536 0.1268 0.0553 0.0365 -0.1674 0.0719 -0.1613 0.0740 0.3225 0.2324 -0.2295 -0.2282 -0.0573 0.0303 -0.0586 0.0334
va: 1.5026 3.9788 4.0332 4.3269 3.8211 0.9953 4.0230 0.9730 0.9719 4.0064 4.2004 3.8983 3.8992 0.9315 3.9010 0.9873 0.9920 0.9871 0.9870 0.9913 0.9877 0.9871 0.9917 0.9874 0.9516 0.9872 0.9812 3.7795 3.8621 3.8718 4.0442 0.9940 4.0400 0.9915 3.8406 3.9589 1.9459 1.9467 4.1040 3.1572 4.1058 3.1581
dispersion: -0.122532713 hartree
energy: -1449.961557668439 hartree
dipole: 6.456705132 -5.801987115 0.654718018 343.588911694 -349.909913361 -6.321001667 -14.331199274 17.359667759 3.028468485
dipolemethod: SCF
magnitude: 7.039555321 au
magnitude: 17.893127635 debye
