program: Orca
programVersion: 6.1.x
elementType: Au C C C C H C H H C P C C H C H H H H H H H H H H H H C C C C H C H C H H C N
elementType: Au
keywords: irc wb97x-d3bj def2-svp def2/J defgrid1 tightscf
charge: 1
multiplicity: 1
formula: C16H20AuNP
InChI: InChI=1/C13H11N.C3H9P.Au/c1-3-4-5-11(2)13-8-6-12(10-14)7-9-13;1-4(2)3;/h1,6-9H,2,4-5H2;1-3H3;/rC16H20AuNP/c1-13(6-7-14(2)17-19(3,4)5)16-10-8-15(12-18)9-11-16/h2,8-11H,1,6-7H2,3-5H3
39 atoms
Au -0.140092 -1.794295 0.145043
C  0.928344 0.402437 1.366273
C  -0.266876 0.065685 1.12071
C  0.033287 2.599036 2.033056
C  1.148562 2.153121 2.663656
H  1.062205 1.546564 3.558874
C  -1.53512 0.797985 1.366029
H  -2.323762 0.137501 1.752327
H  -1.886817 1.194899 0.400397
C  -1.270495 1.962649 2.369742
P  -0.126422 -3.824661 -0.930264
C  0.543965 -3.743465 -2.616377
C  0.861171 -5.088344 -0.077607
H  1.992583 0.279212 1.268665
C  -1.785098 -4.543689 -1.104315
H  -2.423838 -3.857583 -1.680402
H  -1.724597 -5.512204 -1.624803
H  -2.228456 -4.690416 -0.108045
H  -0.056669 -3.043689 -3.216481
H  0.518125 -4.741402 -3.081304
H  1.582574 -3.381903 -2.581961
H  1.90546 -4.749751 -0.0035
H  0.82229 -6.037314 -0.634911
H  0.464164 -5.242375 0.936947
H  2.130972 2.546134 2.424046
H  -2.111213 2.665536 2.307069
H  -1.22949 1.551464 3.3868
C  0.107124 3.553536 0.895553
C  -0.945003 4.449788 0.653568
C  1.227137 3.572647 0.046979
C  -0.878804 5.35653 -0.400873
H  -1.821627 4.460627 1.303576
C  1.300363 4.467092 -1.014362
H  2.046029 2.867557 0.204158
C  0.244562 5.364098 -1.23825
H  -1.697409 6.058129 -0.576431
H  2.170555 4.470797 -1.674696
C  0.313953 6.295902 -2.339857
N  0.369088 7.042483 -3.222849
elementType: Au C H P N
totalener: -1153.29836722639493 hartree
nucrepener: 1565.00081803890862 hartree
electener: -2718.21085699293781 hartree
oneelecener: -4712.55610966228051 hartree
twoeener: 1994.34525266934270 hartree
cpcmener: -0.08448546087358 hartree
kineticenergy: 1054.78355887914017 hartree
exchangeener: -88.405746243872 hartree
energy: -2098.6471 -392.9495 -281.6216 -281.5825 -281.5677 -281.3109 -281.2438 -281.0215 -280.9916 -280.9882 -280.8235 -280.8210 -280.6549 -280.6146 -280.4220 -280.3974 -280.3962 -280.3933 -182.7671 -132.6311 -132.6306 -132.5929 -116.8547 -67.6275 -67.1324 -67.1118 -28.6468 -28.1083 -27.3245 -25.8484 -25.3097 -24.6913 -24.6352 -24.1988 -22.7985 -22.7963 -21.7645 -21.4487 -20.5375 -19.3342 -18.8522 -18.8112 -18.3925 -17.0371 -16.8212 -16.4164 -16.0282 -15.8347 -15.5877 -15.5007 -15.3004 -15.2886 -15.2009 -14.8656 -14.6249 -14.4245 -14.4138 -14.2540 -13.9260 -13.7630 -13.5292 -13.4728 -13.1359 -13.1253 -12.9724 -12.8598 -12.7801 -12.4290 -12.2789 -12.1172 -11.7668 -11.7462 -11.6331 -10.8020 -10.5905 -10.3155 -10.2753 -9.3915 -0.7243 0.4756 1.0394 1.1479 1.5013 2.0106 2.3723 2.8615 3.1361 3.3348 3.8829 electronvolt
chargesum: 1.0000000
charge: 0.123670 -0.100761 -0.311008 -0.173213 -0.286631 0.118472 0.179286 0.065811 0.066797 0.197577 0.089793 -0.134986 -0.133455 0.243425 -0.130759 0.093220 0.081189 0.092424 0.092946 0.082349 0.092078 0.093098 0.081590 0.091991 0.150983 0.058797 0.045657 0.126805 -0.028095 -0.037532 0.049434 0.047550 0.052341 0.051583 -0.162528 0.045934 0.044583 -0.033286 -0.027130
charge: 0.018708 -0.100240 -0.566784 -0.547451 -0.300023 0.202362 0.266619 0.076953 0.084591 0.251761 0.771729 -0.172623 -0.172557 0.224092 -0.172177 0.052392 0.044326 0.052270 0.052255 0.044418 0.051844 0.051981 0.044360 0.052083 0.194270 0.070329 0.075841 0.219601 0.020784 0.028903 0.020339 0.054166 0.019446 0.059806 -0.075982 0.054578 0.054435 0.012322 -0.119723
qa: 0.1237 -0.1008 -0.3110 -0.1732 -0.2866 0.1185 0.1793 0.0658 0.0668 0.1976 0.0898 -0.1350 -0.1335 0.2434 -0.1308 0.0932 0.0812 0.0924 0.0929 0.0823 0.0921 0.0931 0.0816 0.0920 0.1510 0.0588 0.0457 0.1268 -0.0281 -0.0375 0.0494 0.0475 0.0523 0.0516 -0.1625 0.0459 0.0446 -0.0333 -0.0271
va: 1.5029 3.9882 4.0918 4.3121 3.8063 0.9927 4.0182 0.9729 0.9739 4.0064 4.2044 3.8986 3.8985 0.9285 3.9016 0.9868 0.9921 0.9869 0.9870 0.9911 0.9877 0.9870 0.9917 0.9873 0.9637 0.9855 0.9819 3.7867 3.8427 3.8476 3.8678 0.9879 3.8632 0.9839 3.8728 0.9918 0.9918 4.0621 3.1380
dispersion: -0.109242838 hartree
energy: -1153.407610064817 hartree
dipole: 10.106374876 -10.059741657 0.046633219 244.145428350 -247.683933086 -3.538504736 -18.232935210 20.255262923 2.022327713
dipolemethod: SCF
magnitude: 4.075904783 au
magnitude: 10.360126627 debye
