program: Orca
programVersion: 6.1.x
elementType: C H H C C H C H H C C H H Au P C C C H H H H H H H H H C C C C H C H C N O O F F
elementType: Au
keywords: opt freq wb97x-d3bj def2-tzvp(-f) def2/J tightopt verytightscf
charge: 1
multiplicity: 1
frequency: 0.00 0.00 0.00 0.00 0.00 0.00 14.85 24.62 30.56 43.68 49.04 63.03 70.61 83.43 88.52 111.44 138.25 158.00 169.99 172.82 180.15 182.13 200.07 207.61 218.36 221.84 233.45 257.14 261.23 265.89 273.84 293.35 316.33 325.46 377.25 404.48 414.40 449.02 476.56 496.87 548.87 563.34 573.96 596.41 620.52 632.94 680.79 699.72 706.38 730.94 750.43 763.51 778.32 785.13 808.88 811.66 837.72 847.65 874.57 877.62 879.93 904.80 916.61 966.14 973.43 975.62 981.79 986.07 999.54 1015.27 1055.87 1082.59 1117.83 1189.34 1210.81 1242.64 1247.85 1296.85 1320.81 1338.55 1341.75 1353.14 1367.78 1371.48 1404.04 1441.29 1446.47 1449.83 1451.64 1454.26 1455.12 1458.19 1462.56 1464.83 1483.15 1497.42 1544.20 1625.00 1671.70 1701.50 1731.95 2135.28 3076.06 3083.64 3084.47 3099.98 3104.63 3145.53 3156.34 3166.62 3167.64 3169.10 3175.83 3176.35 3198.80 3204.60 3251.30 3251.60 3262.76 3397.79
frequency: 14.85 24.62 30.56 43.68 49.04 63.03 70.61 83.43 88.52 111.44 138.25 158.00 169.99 172.82 180.15 182.13 200.07 207.61 218.36 221.84 233.45 257.14 261.23 265.89 273.84 293.35 316.33 325.46 377.25 404.48 414.40 449.02 476.56 496.87 548.87 563.34 573.96 596.41 620.52 632.94 680.79 699.72 706.38 730.94 750.43 763.51 778.32 785.13 808.88 811.66 837.72 847.65 874.57 877.62 879.93 904.80 916.61 966.14 973.43 975.62 981.79 986.07 999.54 1015.27 1055.87 1082.59 1117.83 1189.34 1210.81 1242.64 1247.85 1296.85 1320.81 1338.55 1341.75 1353.14 1367.78 1371.48 1404.04 1441.29 1446.47 1449.83 1451.64 1454.26 1455.12 1458.19 1462.56 1464.83 1483.15 1497.42 1544.20 1625.00 1671.70 1701.50 1731.95 2135.28 3076.06 3083.64 3084.47 3099.98 3104.63 3145.53 3156.34 3166.62 3167.64 3169.10 3175.83 3176.35 3198.80 3204.60 3251.30 3251.60 3262.76 3397.79
formula: C15H18F2AuNO2P
InChI: InChI=1/C12H9F2NO2.C3H9P.Au/c1-3-4-5-8(2)9-6-10(13)12(15(16)17)11(14)7-9;1-4(2)3;/h1,6-7H,2,4-5H2;1-3H3;/rC15H18AuF2NO2P/c1-10(5-6-12-9-16(12)22(2,3)4)11-7-13(17)15(19(20)21)14(18)8-11/h7-9H,1,5-6H2,2-4H3
40 atoms
C  -1.13587 -1.212122 2.859502
H  -0.458071 -1.716605 2.168388
H  -1.504983 -1.963276 3.562274
C  -2.297027 -0.699946 2.119489
C  -3.333103 -0.241416 1.666307
H  -4.327455 0.1070 1.463929
C  -0.378345 2.229971 2.766269
H  0.006792 3.034495 2.149784
H  -1.182415 2.474274 3.452323
C  0.119746 0.995404 2.722639
C  -0.421642 -0.08548 3.62517
H  0.379553 -0.539888 4.211605
H  -1.121256 0.364151 4.330706
Au -1.964364 -0.151712 -0.093222
P  -1.147215 0.047259 -2.220468
C  -2.362599 -0.484739 -3.447522
C  -0.700468 1.73016 -2.695225
C  0.30278 -0.992772 -2.499738
H  0.002755 -2.03937 -2.41956
H  0.708929 -0.803487 -3.49577
H  1.062445 -0.789289 -1.747074
H  -2.642692 -1.52204 -3.257595
H  -1.933245 -0.398804 -4.448558
H  -3.251816 0.143945 -3.377276
H  -1.592459 2.357959 -2.65189
H  -0.304953 1.728467 -3.713552
H  0.048104 2.130403 -2.013317
C  1.217249 0.644759 1.777512
C  2.117413 -0.377643 2.080851
C  1.355437 1.341916 0.573743
C  3.145067 -0.66627 1.207925
H  2.048762 -0.955648 2.992703
C  2.386095 1.029067 -0.282031
H  0.664209 2.123509 0.288939
C  3.299174 0.023714 0.014075
N  4.370435 -0.316411 -0.920615
O  5.496996 -0.397669 -0.476218
O  4.058187 -0.498107 -2.081199
F  2.522865 1.714297 -1.424841
F  3.991956 -1.659327 1.502206
totalener: -1464.84375420101628 hartree
nucrepener: 2264.18981145973839 hartree
electener: -3728.94289599886497 hartree
oneelecener: -6538.61732608572584 hartree
twoeener: 2809.67443008686087 hartree
cpcmener: -0.08878501036014 hartree
kineticenergy: 1369.81576784259551 hartree
exchangeener: -110.659527649489 hartree
dispersion: -0.115161761 hartree
dispersion: -0.116353968 hartree
dispersion: -0.116347045 hartree
dispersion: -0.116242542 hartree
dispersion: -0.116412043 hartree
dispersion: -0.116332045 hartree
dispersion: -0.116274083 hartree
dispersion: -0.116266724 hartree
dispersion: -0.116286255 hartree
dispersion: -0.116362483 hartree
dispersion: -0.116392010 hartree
dispersion: -0.116442458 hartree
dispersion: -0.116451164 hartree
dispersion: -0.116438753 hartree
dispersion: -0.116438934 hartree
dispersion: -0.116436850 hartree
dispersion: -0.116445968 hartree
dispersion: -0.116454473 hartree
dispersion: -0.116474076 hartree
dispersion: -0.116502368 hartree
dispersion: -0.116540159 hartree
dispersion: -0.116667367 hartree
dispersion: -0.116735404 hartree
dispersion: -0.116885621 hartree
dispersion: -0.117181962 hartree
dispersion: -0.117721012 hartree
dispersion: -0.117664824 hartree
dispersion: -0.117592863 hartree
dispersion: -0.117197503 hartree
dispersion: -0.117429352 hartree
dispersion: -0.117714504 hartree
dispersion: -0.117441065 hartree
dispersion: -0.117434086 hartree
dispersion: -0.117428911 hartree
dispersion: -0.117398051 hartree
dispersion: -0.117395305 hartree
dispersion: -0.117387598 hartree
dispersion: -0.117391460 hartree
dispersion: -0.117398268 hartree
dispersion: -0.117409421 hartree
dispersion: -0.117423709 hartree
dispersion: -0.117432611 hartree
dispersion: -0.117437442 hartree
dispersion: -0.117440376 hartree
elementType: C H Au P N O F
energy: -2098.9181 -675.1791 -675.1378 -524.5764 -524.5671 -399.7247 -283.2751 -283.2658 -282.0536 -281.6467 -281.2199 -281.1332 -280.8901 -280.5724 -280.5294 -280.5255 -280.2560 -279.9646 -279.9635 -279.9524 -279.8760 -182.6885 -132.4226 -132.4219 -132.3974 -117.3444 -68.1403 -67.6614 -67.5572 -38.4038 -38.0932 -38.0083 -33.3738 -28.9196 -27.4284 -26.7476 -25.7917 -25.5829 -25.2544 -24.6021 -23.2545 -23.1759 -23.1248 -22.1133 -21.5382 -21.0704 -19.8953 -19.3188 -19.2767 -19.0080 -18.8617 -18.2987 -18.0805 -17.7778 -17.6119 -17.3673 -17.2731 -16.8684 -16.5268 -16.4871 -15.9935 -15.9483 -15.4925 -15.3934 -15.2163 -15.0515 -14.8145 -14.6019 -14.5744 -14.4867 -14.2625 -14.0845 -13.9782 -13.8537 -13.4953 -13.2071 -13.1446 -12.8165 -12.6443 -12.4084 -12.3148 -12.2510 -12.1993 -12.1456 -12.1303 -11.6301 -11.3211 -11.0300 -10.4771 -10.1791 -9.7005 -0.6993 0.3177 0.6567 1.0269 1.4433 1.7262 2.0974 2.5005 2.6509 2.6862 3.1463 electronvolt
chargesum: 1.0000000
charge: -0.233045 0.209224 0.184025 0.021369 -0.247650 0.233639 -0.287115 0.148092 0.141947 0.014519 -0.218822 0.162644 0.155215 0.220836 0.675296 -0.602577 -0.583027 -0.568387 0.186260 0.178956 0.150848 0.183504 0.177080 0.183110 0.183474 0.177338 0.165432 0.416113 -0.366758 -0.354621 0.285022 0.143676 0.228973 0.179087 0.140267 0.486374 -0.347473 -0.352198 -0.237951 -0.232698
charge: -0.184609 0.162574 0.165280 -0.099250 -0.096305 0.163080 -0.117535 0.127220 0.128086 -0.149288 -0.163301 0.145587 0.147481 0.301514 0.659516 -0.426509 -0.425860 -0.422959 0.130356 0.126016 0.122710 0.127942 0.124447 0.128053 0.129474 0.125594 0.120830 -0.065310 -0.056215 -0.060331 -0.130070 0.163484 -0.140773 0.164306 -0.084246 0.019032 -0.046755 -0.050995 0.119858 0.117870
qa: -0.2330 0.2092 0.1840 0.0214 -0.2477 0.2336 -0.2871 0.1481 0.1419 0.0145 -0.2188 0.1626 0.1552 0.2208 0.6753 -0.6026 -0.5830 -0.5684 0.1863 0.1790 0.1508 0.1835 0.1771 0.1831 0.1835 0.1773 0.1654 0.4161 -0.3668 -0.3546 0.2850 0.1437 0.2290 0.1791 0.1403 0.4864 -0.3475 -0.3522 -0.2380 -0.2327
va: 3.9388 0.9234 0.9496 3.5698 3.5996 0.9484 3.9082 0.9695 0.9713 3.8322 3.8779 0.9519 0.9603 1.7181 4.1732 3.8387 3.8400 3.8448 0.9530 0.9554 0.9666 0.9506 0.9540 0.9508 0.9531 0.9563 0.9698 3.5103 3.8797 3.8363 4.0113 0.9774 3.9854 0.9533 3.7597 4.2617 1.9525 1.9497 1.0825 1.0937
dispersion: -0.117439274 hartree
energy: -1464.962031379516 hartree
dipole: 261.780402049 -266.366406519 -4.586004470 25.220730873 -24.959140464 0.261590409 15.636820117 -15.009719887 0.627100230
dipolemethod: SCF
magnitude: 4.636067433 au
magnitude: 11.783946929 debye
temp: 298.15 k
press: 1.00 atm
zeropoint: 0.30516417 hartree
thermalvibcorrection: 0.02224413 hartree
thermalrotcorrection: 0.00141627 hartree
thermaltrasncorrection: 0.00141627 hartree
thermaltotal: -1464.63179054 hartree
thermalcorr: 0.02507667 hartree
nonthermalcorr: 0.30516417 hartree
totalcorr: 0.33024084 hartree
thermalcorrenthalpy: 0.00094421 hartree
totalenthalpy: -1464.63084633 hartree
vibrat: 0.04047228 hartree
rotat: 0.01684257 hartree
transl: 0.02117938 hartree
total: 0.07849423 hartree
totalentropycorr: -0.07849423 hartree
gibbsenthalpy: -1464.70934056 hartree
gibbsminuselec: 0.25269082 hartree
