program: Orca
programVersion: 6.1.x
elementType: C H H C C H C H H C C H H Au P C C C H H H H H H H H H C C C C H C H C H N C C H H H H H H F
elementType: Au
keywords: opt freq wb97x-d3bj def2-tzvp(-f) def2/J tightopt verytightscf
charge: 1
multiplicity: 1
frequency: 0.00 0.00 0.00 0.00 0.00 0.00 22.15 30.74 32.08 39.91 57.63 65.83 78.53 95.64 104.39 113.54 148.43 161.12 170.40 179.31 183.49 189.24 200.53 207.22 221.15 237.92 245.53 252.56 255.89 258.19 262.22 301.44 315.15 317.87 345.57 377.23 390.82 403.11 410.93 439.30 490.88 498.11 531.54 545.80 590.66 603.58 673.11 677.39 684.28 706.34 745.95 746.49 748.40 773.43 779.96 784.83 809.27 839.42 853.11 865.39 876.36 877.13 920.47 947.77 959.17 975.41 976.54 981.85 984.04 990.48 995.08 1020.44 1053.13 1084.16 1120.69 1126.60 1156.44 1178.48 1201.72 1213.16 1234.03 1249.96 1252.46 1286.28 1318.27 1337.75 1338.69 1350.63 1351.10 1365.23 1380.97 1396.37 1442.18 1444.51 1446.34 1447.93 1452.68 1452.90 1453.87 1461.82 1464.67 1468.07 1479.21 1483.37 1488.74 1490.94 1500.18 1514.89 1576.58 1635.79 1698.53 1728.40 2134.60 3010.44 3027.56 3076.22 3078.92 3080.06 3089.62 3104.31 3111.79 3117.62 3139.44 3154.01 3155.14 3166.87 3167.52 3168.02 3168.21 3175.58 3185.61 3191.78 3195.69 3217.40 3225.99 3242.85 3253.90 3397.93
frequency: 22.15 30.74 32.08 39.91 57.63 65.83 78.53 95.64 104.39 113.54 148.43 161.12 170.40 179.31 183.49 189.24 200.53 207.22 221.15 237.92 245.53 252.56 255.89 258.19 262.22 301.44 315.15 317.87 345.57 377.23 390.82 403.11 410.93 439.30 490.88 498.11 531.54 545.80 590.66 603.58 673.11 677.39 684.28 706.34 745.95 746.49 748.40 773.43 779.96 784.83 809.27 839.42 853.11 865.39 876.36 877.13 920.47 947.77 959.17 975.41 976.54 981.85 984.04 990.48 995.08 1020.44 1053.13 1084.16 1120.69 1126.60 1156.44 1178.48 1201.72 1213.16 1234.03 1249.96 1252.46 1286.28 1318.27 1337.75 1338.69 1350.63 1351.10 1365.23 1380.97 1396.37 1442.18 1444.51 1446.34 1447.93 1452.68 1452.90 1453.87 1461.82 1464.67 1468.07 1479.21 1483.37 1488.74 1490.94 1500.18 1514.89 1576.58 1635.79 1698.53 1728.40 2134.60 3010.44 3027.56 3076.22 3078.92 3080.06 3089.62 3104.31 3111.79 3117.62 3139.44 3154.01 3155.14 3166.87 3167.52 3168.02 3168.21 3175.58 3185.61 3191.78 3195.69 3217.40 3225.99 3242.85 3253.90 3397.93
formula: C17H25FAuNP
InChI: InChI=1/C14H16FN.C3H9P.Au/c1-5-6-7-11(2)12-8-9-14(16(3)4)13(15)10-12;1-4(2)3;/h1,8-10H,2,6-7H2,3-4H3;1-3H3;/rC17H25AuFNP/c1-13(7-9-15-12-18(15)21(4,5)6)14-8-10-17(20(2)3)16(19)11-14/h8,10-12H,1,7,9H2,2-6H3
46 atoms
C  -0.082055 3.038487 1.444138
H  -0.003643 2.053758 1.907443
H  -0.58112 3.694966 2.16053
C  -0.933088 2.932739 0.25016
C  -1.583082 2.975267 -0.781651
H  -2.143222 3.228677 -1.660652
C  2.337437 3.632419 -1.146514
H  2.835025 3.180531 -1.997842
H  2.180234 4.705888 -1.175118
C  1.950059 2.914522 -0.092563
C  1.310168 3.593407 1.094629
H  1.936118 3.482527 1.984262
H  1.229794 4.660811 0.884837
Au -1.461105 0.780787 -0.335586
P  -1.771409 -1.475829 -0.179186
C  -3.517446 -1.930721 -0.266766
C  -0.953383 -2.457689 -1.45275
C  -1.186295 -2.083544 1.417843
H  -1.768484 -1.605637 2.208084
H  -1.311852 -3.166822 1.476761
H  -0.135851 -1.823138 1.546527
H  -4.068671 -1.414858 0.521027
H  -3.621387 -3.010926 -0.139984
H  -3.922783 -1.636788 -1.236452
H  -1.324779 -2.152562 -2.432846
H  -1.169417 -3.516676 -1.294549
H  0.122028 -2.289502 -1.412919
C  2.125165 1.437825 -0.057307
C  2.375873 0.764717 1.141375
C  2.080139 0.677007 -1.22431
C  2.618414 -0.590704 1.13424
H  2.436237 1.28922 2.088095
C  2.321764 -0.689782 -1.208883
H  1.84587 1.15633 -2.167843
C  2.612649 -1.376426 -0.024908
H  2.279753 -1.236019 -2.142028
N  2.948539 -2.739214 0.019915
C  3.223166 -3.372751 -1.260875
C  2.114004 -3.595075 0.863749
H  3.647091 -4.360182 -1.068037
H  2.321713 -3.503492 -1.877318
H  3.953753 -2.789748 -1.823902
H  1.156586 -3.826907 0.37782
H  2.643033 -4.533441 1.044078
H  1.914774 -3.125325 1.823434
F  2.928124 -1.176306 2.321642
totalener: -1295.03679493709637 hartree
nucrepener: 2145.67305262666605 hartree
electener: -3440.62364131724007 hartree
oneelecener: -6065.73431777940095 hartree
twoeener: 2625.11067646216088 hartree
cpcmener: -0.08203713414530 hartree
kineticenergy: 1200.61416746774034 hartree
exchangeener: -100.266757997671 hartree
dispersion: -0.128734212 hartree
dispersion: -0.128735141 hartree
dispersion: -0.128721720 hartree
dispersion: -0.128713618 hartree
dispersion: -0.128695239 hartree
dispersion: -0.128687065 hartree
dispersion: -0.128678141 hartree
dispersion: -0.128673671 hartree
elementType: C H Au P N F
energy: -2098.8880 -674.4053 -392.7749 -282.0981 -281.5890 -281.0826 -281.0480 -280.7829 -280.2517 -280.2130 -280.1373 -280.1362 -280.0899 -280.0371 -279.9469 -279.9396 -279.9286 -279.9040 -279.8861 -279.4715 -182.6582 -132.3925 -132.3918 -132.3668 -117.2686 -68.0685 -67.5865 -67.4803 -37.2054 -29.6865 -27.7276 -26.9730 -25.9616 -25.5681 -24.7103 -24.4712 -23.9050 -23.1833 -23.1324 -23.0763 -21.7634 -21.7333 -20.4787 -19.9889 -19.0616 -18.9839 -18.7072 -17.6437 -17.2695 -17.0597 -16.9117 -16.5530 -16.2898 -16.0550 -15.9399 -15.8590 -15.4588 -15.3868 -15.3509 -15.1137 -14.9785 -14.7610 -14.6824 -14.5829 -14.5095 -14.3935 -14.0701 -13.9021 -13.7268 -13.4579 -13.4164 -13.3164 -13.2345 -13.1509 -12.9421 -12.8437 -12.6148 -12.3287 -12.1986 -12.1241 -12.0819 -11.5204 -11.2150 -10.9920 -10.4015 -9.9495 -9.7562 -8.2206 0.4257 0.9066 1.2798 1.5913 1.7876 2.1815 2.5754 2.7652 2.9676 3.2303 3.4412 electronvolt
chargesum: 1.0000000
charge: -0.243674 0.201814 0.181030 -0.021245 -0.203488 0.231261 -0.332228 0.138926 0.132205 0.069384 -0.224053 0.152403 0.142761 0.216699 0.682882 -0.599813 -0.575621 -0.588073 0.192939 0.175900 0.169174 0.183252 0.175666 0.182905 0.190160 0.176653 0.143796 0.319708 -0.346367 -0.303789 0.262590 0.134051 -0.273377 0.134600 0.174526 0.146090 -0.172362 -0.312500 -0.293715 0.152512 0.129767 0.150043 0.113046 0.153122 0.152266 -0.271823
charge: -0.187092 0.162950 0.162540 -0.100056 -0.094486 0.161938 -0.157329 0.121929 0.121988 -0.152900 -0.165570 0.144952 0.144444 0.297617 0.659167 -0.427053 -0.426979 -0.425369 0.129998 0.123904 0.125046 0.127925 0.123800 0.128079 0.129814 0.124223 0.121917 -0.115323 -0.074114 -0.099155 -0.146323 0.156641 -0.109974 0.149791 -0.148149 0.150105 0.025032 -0.250647 -0.245766 0.115704 0.101230 0.116705 0.101583 0.112710 0.111539 0.073017
qa: -0.2437 0.2018 0.1810 -0.0212 -0.2035 0.2313 -0.3322 0.1389 0.1322 0.0694 -0.2241 0.1524 0.1428 0.2167 0.6829 -0.5998 -0.5756 -0.5881 0.1929 0.1759 0.1692 0.1833 0.1757 0.1829 0.1902 0.1767 0.1438 0.3197 -0.3464 -0.3038 0.2626 0.1341 -0.2734 0.1346 0.1745 0.1461 -0.1724 -0.3125 -0.2937 0.1525 0.1298 0.1500 0.1130 0.1531 0.1523 -0.2718
va: 3.9743 0.9273 0.9498 3.6170 3.5554 0.9475 3.9077 0.9720 0.9727 3.7633 3.8990 0.9550 0.9634 1.7269 4.1835 3.8460 3.8375 3.8378 0.9488 0.9552 0.9561 0.9500 0.9550 0.9504 0.9521 0.9573 0.9701 3.5490 3.8669 3.9013 3.9758 0.9785 3.7893 0.9715 3.9646 0.9738 3.0644 3.9201 3.8783 0.9574 0.9512 0.9570 0.9509 0.9557 0.9620 1.0274
dispersion: -0.128668113 hartree
energy: -1295.165546307009 hartree
dipole: 219.196504057 -221.864616961 -2.668112904 -103.769509721 103.082033267 -0.687476454 37.789719969 -38.287061550 -0.497341581
dipolemethod: SCF
magnitude: 2.799785526 au
magnitude: 7.116489250 debye
temp: 298.15 k
press: 1.00 atm
zeropoint: 0.38440097 hartree
thermalvibcorrection: 0.02274962 hartree
thermalrotcorrection: 0.00141627 hartree
thermaltrasncorrection: 0.00141627 hartree
thermaltotal: -1294.75556318 hartree
thermalcorr: 0.02558216 hartree
nonthermalcorr: 0.38440097 hartree
totalcorr: 0.40998313 hartree
thermalcorrenthalpy: 0.00094421 hartree
totalenthalpy: -1294.75461897 hartree
vibrat: 0.04083300 hartree
rotat: 0.01665804 hartree
transl: 0.02112299 hartree
total: 0.07861403 hartree
totalentropycorr: -0.07861403 hartree
gibbsenthalpy: -1294.83323300 hartree
gibbsminuselec: 0.33231331 hartree
