program: Orca
programVersion: 6.1.x
elementType: C H H C C H C H H C C H H Au P C C C H H H H H H H H H C C C C H C H C H H C H H H
elementType: Au
keywords: opt freq wb97x-d3bj def2-tzvp(-f) def2/J tightopt verytightscf
charge: 1
multiplicity: 1
frequency: 0.00 0.00 0.00 0.00 0.00 0.00 14.71 17.75 29.50 36.60 44.61 69.88 99.76 124.77 140.64 141.04 180.63 183.57 193.49 207.16 209.11 220.46 222.36 224.03 243.79 258.30 261.01 363.41 363.89 398.85 418.10 426.00 439.84 475.06 510.31 530.88 564.51 675.45 704.78 706.38 724.18 756.86 773.80 774.35 806.07 823.26 837.45 864.02 870.73 871.86 900.29 908.68 924.46 963.57 970.91 971.66 978.76 982.32 998.10 1005.40 1026.66 1036.71 1040.50 1048.35 1079.64 1083.41 1134.53 1146.80 1166.45 1172.56 1206.52 1239.46 1263.71 1265.96 1300.30 1330.28 1334.85 1335.60 1347.94 1352.20 1372.41 1379.22 1419.47 1431.56 1445.68 1448.58 1448.99 1455.53 1456.11 1462.32 1462.91 1469.24 1474.61 1497.27 1507.67 1531.87 1565.28 1648.14 1673.83 1683.31 3070.66 3071.31 3071.88 3072.16 3076.93 3090.66 3115.02 3129.68 3136.76 3158.71 3160.81 3161.38 3161.97 3167.59 3167.63 3167.68 3186.19 3197.37 3200.98 3205.95 3230.74 3251.99 3256.89
frequency: 14.71 17.75 29.50 36.60 44.61 69.88 99.76 124.77 140.64 141.04 180.63 183.57 193.49 207.16 209.11 220.46 222.36 224.03 243.79 258.30 261.01 363.41 363.89 398.85 418.10 426.00 439.84 475.06 510.31 530.88 564.51 675.45 704.78 706.38 724.18 756.86 773.80 774.35 806.07 823.26 837.45 864.02 870.73 871.86 900.29 908.68 924.46 963.57 970.91 971.66 978.76 982.32 998.10 1005.40 1026.66 1036.71 1040.50 1048.35 1079.64 1083.41 1134.53 1146.80 1166.45 1172.56 1206.52 1239.46 1263.71 1265.96 1300.30 1330.28 1334.85 1335.60 1347.94 1352.20 1372.41 1379.22 1419.47 1431.56 1445.68 1448.58 1448.99 1455.53 1456.11 1462.32 1462.91 1469.24 1474.61 1497.27 1507.67 1531.87 1565.28 1648.14 1673.83 1683.31 3070.66 3071.31 3071.88 3072.16 3076.93 3090.66 3115.02 3129.68 3136.76 3158.71 3160.81 3161.38 3161.97 3167.59 3167.63 3167.68 3186.19 3197.37 3200.98 3205.95 3230.74 3251.99 3256.89
formula: C16H23AuP
InChI: InChI=1/C13H14.C3H9P.Au/c1-11-6-5-9-13(10-11)12-7-3-2-4-8-12;1-4(2)3;/h3,5-6,9-10H,4,7-8H2,1H3;1-3H3;/rC16H23AuP/c1-13-6-5-7-15(12-13)14-8-10-16(11-9-14)17-18(2,3)4/h5-7,10,12H,8-9,11H2,1-4H3
41 atoms
C  -0.819773 -1.573232 0.909136
H  0.229332 -1.815829 1.105453
H  -1.208922 -2.356888 0.255518
C  -0.912489 -0.222896 0.257141
C  -1.414207 0.811094 0.932135
H  -1.457768 1.812912 0.515481
C  -1.965174 0.745672 2.38245
H  -1.747475 1.68218 2.887072
H  -3.048318 0.597993 2.344259
C  -1.31985 -0.426204 2.986119
C  -1.617154 -1.664146 2.2596
H  -1.355943 -2.573883 2.792126
H  -2.678669 -1.674193 2.006589
Au -0.213202 -0.02506 -1.677061
P  0.56859 0.196642 -3.837041
C  -0.036941 1.67476 -4.693967
C  2.373448 0.306396 -3.964622
C  0.120976 -1.177238 -4.931528
H  -0.966307 -1.260934 -4.98347
H  0.521277 -1.009962 -5.934337
H  0.524991 -2.108435 -4.529541
H  -1.127377 1.64718 -4.739149
H  0.368156 1.719491 -5.707702
H  0.268052 2.565398 -4.141088
H  2.726241 1.169706 -3.397036
H  2.675173 0.410128 -5.009615
H  2.82276 -0.595718 -3.544796
C  -0.357718 -0.345279 4.032301
C  0.467135 -1.452509 4.326246
C  -0.196532 0.845075 4.778867
C  1.427686 -1.352057 5.311427
H  0.371894 -2.373382 3.767376
C  0.746826 0.94222 5.783922
H  -0.837359 1.695263 4.586472
C  1.55997 -0.169589 6.032445
H  2.074913 -2.193615 5.527927
H  2.311589 -0.10596 6.813831
C  0.906797 2.199441 6.595538
H  0.708896 2.003018 7.652524
H  1.927929 2.581093 6.516474
H  0.220138 2.975532 6.254392
totalener: -1101.05231057863421 hartree
nucrepener: 1472.59306418890242 hartree
electener: -2573.56418015158033 hartree
oneelecener: -4460.44052043220563 hartree
twoeener: 1886.87634028062553 hartree
cpcmener: -0.07276468416524 hartree
kineticenergy: 1006.77045990888371 hartree
exchangeener: -84.557232805690 hartree
dispersion: -0.106135258 hartree
dispersion: -0.107284140 hartree
dispersion: -0.107017809 hartree
dispersion: -0.107134027 hartree
dispersion: -0.107211540 hartree
dispersion: -0.107317930 hartree
dispersion: -0.107474887 hartree
dispersion: -0.107474604 hartree
dispersion: -0.107452742 hartree
dispersion: -0.107548649 hartree
dispersion: -0.107708192 hartree
dispersion: -0.107947423 hartree
dispersion: -0.107936011 hartree
dispersion: -0.107966531 hartree
dispersion: -0.107972815 hartree
dispersion: -0.108015211 hartree
dispersion: -0.107979377 hartree
dispersion: -0.108011822 hartree
dispersion: -0.108053615 hartree
dispersion: -0.108052394 hartree
dispersion: -0.108047978 hartree
dispersion: -0.108044749 hartree
dispersion: -0.108045985 hartree
dispersion: -0.108052034 hartree
dispersion: -0.108065093 hartree
dispersion: -0.108109396 hartree
dispersion: -0.108081161 hartree
dispersion: -0.108072234 hartree
dispersion: -0.108076398 hartree
dispersion: -0.108081709 hartree
dispersion: -0.108077963 hartree
dispersion: -0.108077196 hartree
dispersion: -0.108074643 hartree
dispersion: -0.108074603 hartree
dispersion: -0.108074428 hartree
dispersion: -0.108074932 hartree
dispersion: -0.108075321 hartree
elementType: C H Au P
energy: -2098.2543 -282.6617 -280.8638 -280.7474 -280.6852 -280.6600 -280.5755 -280.3311 -280.3082 -280.2724 -280.1336 -279.8115 -279.6781 -279.6763 -279.6737 -279.6260 -279.5236 -182.0388 -131.7779 -131.7776 -131.7305 -116.2937 -67.0152 -66.5568 -66.5527 -28.6395 -27.6248 -25.7181 -25.3307 -25.1849 -24.5862 -23.9810 -22.8502 -22.8244 -22.8230 -21.5482 -21.0675 -20.2454 -19.1367 -18.6115 -18.3806 -17.3938 -16.8625 -16.6799 -15.9393 -15.6538 -15.5359 -15.4564 -15.1228 -15.1158 -15.0546 -15.0006 -14.6292 -14.5797 -14.2651 -14.2614 -13.9232 -13.8048 -13.7711 -13.7365 -13.5427 -13.2267 -12.9210 -12.8065 -12.6002 -12.5621 -12.1268 -11.6759 -11.2414 -11.1945 -11.1827 -10.7874 -10.1330 -9.9036 -9.4100 -9.1684 -1.8800 1.1118 1.2212 1.3578 1.9565 2.3082 2.7013 2.9842 3.2778 3.5717 3.6142 electronvolt
chargesum: 1.0000000
charge: -0.187309 0.149688 0.152955 -0.263623 -0.226648 0.135047 -0.145315 0.142464 0.158128 0.286634 -0.235348 0.165494 0.169452 0.017891 0.643395 -0.593267 -0.587500 -0.591224 0.174127 0.162119 0.173418 0.174099 0.162570 0.173617 0.173785 0.161988 0.173350 0.339045 -0.250163 -0.419418 -0.113023 0.152562 0.327416 0.151964 -0.171118 0.138426 0.146321 -0.466885 0.149619 0.149627 0.145638
charge: -0.202221 0.142941 0.142921 -0.408526 -0.185871 0.139305 -0.153658 0.144334 0.162467 0.098862 -0.149827 0.144255 0.162605 0.206938 0.625144 -0.439763 -0.440329 -0.439967 0.123775 0.118065 0.123612 0.123821 0.118048 0.123771 0.123680 0.117997 0.123566 -0.109002 -0.027680 -0.008196 -0.110232 0.156948 -0.144111 0.156662 -0.024869 0.150750 0.156113 -0.222482 0.127998 0.127955 0.124201
qa: -0.1873 0.1497 0.1530 -0.2636 -0.2266 0.1350 -0.1453 0.1425 0.1581 0.2866 -0.2353 0.1655 0.1695 0.0179 0.6434 -0.5933 -0.5875 -0.5912 0.1741 0.1621 0.1734 0.1741 0.1626 0.1736 0.1738 0.1620 0.1734 0.3390 -0.2502 -0.4194 -0.1130 0.1526 0.3274 0.1520 -0.1711 0.1384 0.1463 -0.4669 0.1496 0.1496 0.1456
va: 3.9352 0.9487 0.9466 3.7935 3.9993 0.9486 3.8627 0.9683 0.9609 3.7322 3.9392 0.9568 0.9542 1.6441 4.0206 3.8389 3.8379 3.8366 0.9551 0.9586 0.9556 0.9554 0.9586 0.9557 0.9552 0.9586 0.9554 3.6240 3.9621 3.9734 3.9005 0.9684 3.7883 0.9664 3.9245 0.9662 0.9581 3.8610 0.9553 0.9552 0.9658
dispersion: -0.108075669 hartree
energy: -1101.161052966474 hartree
dipole: 24.825598332 -24.523368397 0.302229935 4.351810844 -4.682816067 -0.331005223 253.223872532 -250.475999638 2.747872893
dipolemethod: SCF
magnitude: 2.784189798 au
magnitude: 7.076848059 debye
temp: 298.15 k
press: 1.00 atm
zeropoint: 0.35007411 hartree
thermalvibcorrection: 0.01853011 hartree
thermalrotcorrection: 0.00141627 hartree
thermaltrasncorrection: 0.00141627 hartree
thermaltotal: -1100.78961620 hartree
thermalcorr: 0.02136265 hartree
nonthermalcorr: 0.35007411 hartree
totalcorr: 0.37143676 hartree
thermalcorrenthalpy: 0.00094421 hartree
totalenthalpy: -1100.78867200 hartree
vibrat: 0.03389734 hartree
rotat: 0.01669223 hartree
transl: 0.02098018 hartree
total: 0.07156974 hartree
totalentropycorr: -0.07156974 hartree
gibbsenthalpy: -1100.86024174 hartree
gibbsminuselec: 0.30081123 hartree
