program: Orca
programVersion: 6.1.x
elementType: C H H C C H C H H C C H H Au P C C C H H H H H H H H H C C C C H C H C H H N C C H H H H H H
elementType: Au
keywords: opt freq wb97x-d3bj def2-tzvp(-f) def2/J tightopt verytightscf
charge: 1
multiplicity: 1
frequency: 0.00 0.00 0.00 0.00 0.00 0.00 10.11 13.23 32.91 34.50 49.48 58.85 89.10 96.09 128.78 131.75 143.45 163.79 175.17 183.11 184.34 196.56 202.16 210.83 222.07 223.11 231.91 259.23 260.59 293.07 323.77 328.41 362.21 423.02 432.14 440.16 462.23 499.17 504.10 519.90 539.34 624.66 635.78 696.48 705.65 756.49 768.69 772.94 773.10 787.32 800.12 805.11 818.92 862.86 870.38 871.37 907.77 945.46 958.41 969.32 970.33 970.86 977.73 979.72 1002.69 1004.75 1016.10 1024.93 1062.44 1073.38 1092.47 1130.47 1152.43 1161.89 1171.71 1201.92 1218.29 1230.58 1243.36 1272.99 1286.85 1302.73 1328.99 1334.35 1334.73 1344.54 1347.47 1378.18 1385.62 1415.28 1446.04 1447.26 1448.84 1449.03 1455.17 1456.07 1456.28 1456.30 1462.35 1470.33 1473.08 1485.62 1492.10 1495.61 1498.81 1516.47 1543.58 1572.16 1599.43 1657.80 1678.74 1693.52 3041.82 3056.98 3070.88 3071.44 3071.63 3078.67 3080.99 3083.07 3107.57 3150.91 3151.95 3159.24 3160.33 3160.55 3161.18 3166.84 3167.40 3167.56 3168.63 3181.68 3198.71 3211.69 3251.43 3253.17 3266.88 3268.21
frequency: 10.11 13.23 32.91 34.50 49.48 58.85 89.10 96.09 128.78 131.75 143.45 163.79 175.17 183.11 184.34 196.56 202.16 210.83 222.07 223.11 231.91 259.23 260.59 293.07 323.77 328.41 362.21 423.02 432.14 440.16 462.23 499.17 504.10 519.90 539.34 624.66 635.78 696.48 705.65 756.49 768.69 772.94 773.10 787.32 800.12 805.11 818.92 862.86 870.38 871.37 907.77 945.46 958.41 969.32 970.33 970.86 977.73 979.72 1002.69 1004.75 1016.10 1024.93 1062.44 1073.38 1092.47 1130.47 1152.43 1161.89 1171.71 1201.92 1218.29 1230.58 1243.36 1272.99 1286.85 1302.73 1328.99 1334.35 1334.73 1344.54 1347.47 1378.18 1385.62 1415.28 1446.04 1447.26 1448.84 1449.03 1455.17 1456.07 1456.28 1456.30 1462.35 1470.33 1473.08 1485.62 1492.10 1495.61 1498.81 1516.47 1543.58 1572.16 1599.43 1657.80 1678.74 1693.52 3041.82 3056.98 3070.88 3071.44 3071.63 3078.67 3080.99 3083.07 3107.57 3150.91 3151.95 3159.24 3160.33 3160.55 3161.18 3166.84 3167.40 3167.56 3168.63 3181.68 3198.71 3211.69 3251.43 3253.17 3266.88 3268.21
formula: C17H26AuNP
InChI: InChI=1/C14H17N.C3H9P.Au/c1-15(2)14-10-8-13(9-11-14)12-6-4-3-5-7-12;1-4(2)3;/h4,8-11H,5-7H2,1-2H3;1-3H3;/rC17H26AuNP/c1-19(2)17-12-8-15(9-13-17)14-6-10-16(11-7-14)18-20(3,4)5/h8-10,12-13H,6-7,11H2,1-5H3
46 atoms
C  -1.060023 -1.179284 0.234765
H  -0.060228 -1.535271 0.509911
H  -1.497714 -1.961465 -0.39073
C  -0.942079 0.11071 -0.54586
C  -1.275842 1.258603 0.05282
H  -1.213711 2.205502 -0.478254
C  -1.72561 1.402431 1.503627
H  -1.240076 2.269155 1.946712
H  -2.806676 1.597693 1.531771
C  -1.486061 0.145473 2.269589
C  -1.933802 -1.048724 1.502854
H  -1.918825 -1.972874 2.074306
H  -2.963178 -0.860874 1.180308
Au -0.2587 0.039071 -2.491114
P  0.501754 -0.039527 -4.670742
C  -0.74904 0.392324 -5.910908
C  1.883604 1.081602 -5.020415
C  1.104023 -1.66851 -5.192267
H  0.29977 -2.400829 -5.097819
H  1.444462 -1.634425 -6.229983
H  1.931505 -1.973129 -4.548423
H  -1.591116 -0.298257 -5.832619
H  -0.32496 0.33595 -6.916337
H  -1.11015 1.405801 -5.725252
H  1.576596 2.109626 -4.817965
H  2.191885 0.99339 -6.064971
H  2.725553 0.833966 -4.370942
C  -0.871431 0.093418 3.501198
C  -0.631869 -1.153768 4.179727
C  -0.432781 1.278382 4.191829
C  -0.029737 -1.219664 5.389615
H  -0.936711 -2.080869 3.71446
C  0.164506 1.23368 5.405123
H  -0.584792 2.248429 3.738858
C  0.394397 -0.02317 6.063246
H  0.128378 -2.182862 5.852393
H  0.469648 2.154371 5.880781
N  0.974906 -0.076629 7.251206
C  1.202208 -1.360574 7.919312
C  1.402426 1.147211 7.933769
H  1.680781 -1.174504 8.876621
H  0.255605 -1.875629 8.094161
H  1.854631 -1.996775 7.318049
H  1.860188 0.876261 8.880961
H  2.135643 1.686596 7.331147
H  0.546992 1.796898 8.129346
totalener: -1195.79492812182662 hartree
nucrepener: 1716.29982833612121 hartree
electener: -2912.01323527036720 hartree
oneelecener: -5073.72336451389583 hartree
twoeener: 2161.71012924352863 hartree
cpcmener: -0.07287487885697 hartree
kineticenergy: 1101.04009524231151 hartree
exchangeener: -93.196949482659 hartree
dispersion: -0.116084222 hartree
dispersion: -0.117272900 hartree
dispersion: -0.117006461 hartree
dispersion: -0.117127324 hartree
dispersion: -0.117197079 hartree
dispersion: -0.117235990 hartree
dispersion: -0.117255223 hartree
dispersion: -0.117273193 hartree
dispersion: -0.117290613 hartree
dispersion: -0.117293487 hartree
dispersion: -0.117293196 hartree
dispersion: -0.117296102 hartree
dispersion: -0.117297021 hartree
elementType: C H Au P N
energy: -2098.1557 -394.3030 -282.2365 -281.5619 -280.7053 -280.7046 -280.6982 -280.6959 -280.4362 -280.2083 -280.2074 -279.9319 -279.8529 -279.6322 -279.6194 -279.6165 -279.6139 -279.3168 -279.1765 -181.9410 -131.6809 -131.6801 -131.6309 -116.1455 -66.8592 -66.4076 -66.4040 -31.0091 -28.1214 -27.0249 -25.2558 -25.1921 -25.1121 -24.2180 -23.8781 -23.8438 -22.7627 -22.7591 -22.4684 -20.9967 -20.4574 -20.1770 -19.2396 -18.5424 -18.4049 -17.5875 -17.2209 -16.7176 -16.5986 -16.1753 -15.6537 -15.5404 -15.4428 -15.2506 -15.1048 -15.0545 -15.0503 -14.6138 -14.5939 -14.3435 -14.2971 -14.2044 -14.1910 -14.0856 -13.8391 -13.7965 -13.7124 -13.5240 -13.2611 -12.7981 -12.5836 -12.4920 -12.4331 -11.8918 -11.7129 -11.5209 -11.0623 -11.0401 -11.0138 -10.6714 -9.8021 -9.3564 -9.0434 -8.6509 -1.2545 1.2065 1.3453 1.4478 2.3291 2.5871 2.8430 2.9809 3.2117 3.6080 3.6353 electronvolt
chargesum: 1.0000000
charge: -0.150686 0.126936 0.137046 -0.298034 -0.231621 0.119577 -0.156051 0.131389 0.148480 0.174791 -0.239064 0.144812 0.145309 -0.004207 0.641212 -0.587984 -0.590234 -0.594550 0.172885 0.160744 0.172818 0.172937 0.160192 0.172894 0.172770 0.160540 0.172777 0.407451 -0.311359 -0.310343 -0.242266 0.133140 -0.235947 0.136379 0.396767 0.146170 0.146626 -0.072544 -0.312811 -0.313474 0.171461 0.163464 0.163199 0.171521 0.163393 0.163495
charge: -0.227286 0.136095 0.136496 -0.425995 -0.214451 0.131683 -0.169956 0.139683 0.159849 0.022595 -0.166408 0.134311 0.155555 0.191395 0.621945 -0.441565 -0.441591 -0.441412 0.123206 0.117305 0.123169 0.123189 0.117118 0.123203 0.123234 0.117170 0.123079 -0.130621 -0.028558 -0.029408 -0.106304 0.156030 -0.106049 0.155596 -0.078753 0.154320 0.154486 0.126465 -0.200372 -0.200300 0.124444 0.123279 0.123178 0.124407 0.123307 0.123238
qa: -0.1507 0.1269 0.1370 -0.2980 -0.2316 0.1196 -0.1561 0.1314 0.1485 0.1748 -0.2391 0.1448 0.1453 -0.0042 0.6412 -0.5880 -0.5902 -0.5946 0.1729 0.1607 0.1728 0.1729 0.1602 0.1729 0.1728 0.1605 0.1728 0.4075 -0.3114 -0.3103 -0.2423 0.1331 -0.2359 0.1364 0.3968 0.1462 0.1466 -0.0725 -0.3128 -0.3135 0.1715 0.1635 0.1632 0.1715 0.1634 0.1635
va: 3.8689 0.9596 0.9472 3.8089 3.9852 0.9467 3.8833 0.9712 0.9588 3.7608 3.9803 0.9585 0.9591 1.6422 4.0038 3.8360 3.8360 3.8357 0.9559 0.9588 0.9557 0.9554 0.9589 0.9558 0.9559 0.9589 0.9555 3.4190 3.9371 3.9301 3.9125 0.9801 3.9237 0.9758 3.9151 0.9736 0.9732 3.4145 3.8478 3.8475 0.9576 0.9512 0.9512 0.9576 0.9510 0.9511
dispersion: -0.117296101 hartree
energy: -1195.913144364077 hartree
dipole: 19.943755838 -18.751690371 1.192065466 -4.536768630 4.204656674 -0.332111956 372.393786412 -366.428810055 5.964976356
dipolemethod: SCF
magnitude: 6.091983368 au
magnitude: 15.484591142 debye
temp: 298.15 k
press: 1.00 atm
zeropoint: 0.39717863 hartree
thermalvibcorrection: 0.02109033 hartree
thermalrotcorrection: 0.00141627 hartree
thermaltrasncorrection: 0.00141627 hartree
thermaltotal: -1195.49204286 hartree
thermalcorr: 0.02392288 hartree
nonthermalcorr: 0.39717863 hartree
totalcorr: 0.42110151 hartree
thermalcorrenthalpy: 0.00094421 hartree
totalenthalpy: -1195.49109865 hartree
vibrat: 0.03879544 hartree
rotat: 0.01708367 hartree
transl: 0.02107005 hartree
total: 0.07694916 hartree
totalentropycorr: -0.07694916 hartree
gibbsenthalpy: -1195.56804780 hartree
gibbsminuselec: 0.34509656 hartree
