program: Orca
programVersion: 6.1.x
elementType: C H H C C H C H H C C H H Au P C C C H H H H H H H H H C C C C H C H C H H C C H
elementType: Au
keywords: opt freq wb97x-d3bj def2-tzvp(-f) def2/J tightopt verytightscf
charge: 1
multiplicity: 1
frequency: 0.00 0.00 0.00 0.00 0.00 0.00 3.88 13.73 34.42 36.20 53.28 72.55 99.32 127.72 132.59 145.34 178.58 182.39 187.86 198.87 208.51 220.43 223.15 240.54 258.03 260.32 274.55 350.07 364.02 382.12 403.39 423.93 440.68 475.17 515.22 549.26 553.93 651.53 656.64 704.04 706.69 728.99 733.74 753.86 772.67 774.32 774.54 805.83 812.17 839.96 857.35 870.24 871.63 873.83 883.90 903.50 958.68 970.97 971.11 976.74 980.35 1002.61 1022.80 1024.34 1042.26 1044.59 1072.85 1133.55 1157.35 1167.20 1170.98 1216.42 1238.31 1259.27 1263.36 1291.08 1325.95 1334.35 1335.34 1347.68 1350.70 1355.75 1382.45 1434.48 1445.97 1448.17 1448.35 1455.87 1456.28 1461.59 1462.16 1468.87 1519.43 1531.38 1579.09 1616.92 1669.71 1682.72 2248.89 3071.57 3072.03 3072.40 3078.18 3093.47 3117.87 3131.69 3161.33 3161.58 3162.39 3167.56 3168.04 3168.35 3187.84 3199.89 3202.85 3237.32 3238.90 3260.04 3268.73 3440.99
frequency: 3.88 13.73 34.42 36.20 53.28 72.55 99.32 127.72 132.59 145.34 178.58 182.39 187.86 198.87 208.51 220.43 223.15 240.54 258.03 260.32 274.55 350.07 364.02 382.12 403.39 423.93 440.68 475.17 515.22 549.26 553.93 651.53 656.64 704.04 706.69 728.99 733.74 753.86 772.67 774.32 774.54 805.83 812.17 839.96 857.35 870.24 871.63 873.83 883.90 903.50 958.68 970.97 971.11 976.74 980.35 1002.61 1022.80 1024.34 1042.26 1044.59 1072.85 1133.55 1157.35 1167.20 1170.98 1216.42 1238.31 1259.27 1263.36 1291.08 1325.95 1334.35 1335.34 1347.68 1350.70 1355.75 1382.45 1434.48 1445.97 1448.17 1448.35 1455.87 1456.28 1461.59 1462.16 1468.87 1519.43 1531.38 1579.09 1616.92 1669.71 1682.72 2248.89 3071.57 3072.03 3072.40 3078.18 3093.47 3117.87 3131.69 3161.33 3161.58 3162.39 3167.56 3168.04 3168.35 3187.84 3199.89 3202.85 3237.32 3238.90 3260.04 3268.73 3440.99
formula: C17H21AuP
InChI: InChI=1/C14H12.C3H9P.Au/c1-2-12-8-10-14(11-9-12)13-6-4-3-5-7-13;1-4(2)3;/h1,4,8-11H,5-7H2;1-3H3;/rC17H21AuP/c1-5-14-6-8-15(9-7-14)16-10-12-17(13-11-16)18-19(2,3)4/h1,6-9,12H,10-11,13H2,2-4H3
40 atoms
C  -1.065733 -1.365797 0.582852
H  -0.066445 -1.678861 0.900919
H  -1.448488 -2.147131 -0.077151
C  -0.980486 -0.043661 -0.123991
C  -1.458797 1.056327 0.45621
H  -1.37349 2.040085 0.004671
C  -2.164752 1.096995 1.841136
H  -1.932826 2.03759 2.331369
H  -3.24525 1.025009 1.688932
C  -1.677559 -0.09202 2.547308
C  -2.006631 -1.332807 1.843546
H  -1.87716 -2.236949 2.430651
H  -3.032301 -1.27074 1.477147
Au -0.087343 0.008534 -1.986752
P  0.897307 0.06085 -4.072927
C  -0.226148 0.555509 -5.406615
C  2.294818 1.206947 -4.210936
C  1.564833 -1.535377 -4.613272
H  0.761674 -2.274342 -4.641417
H  2.009799 -1.443781 -5.606974
H  2.324579 -1.870616 -3.904537
H  -1.063462 -0.143469 -5.454383
H  0.300091 0.558872 -6.364185
H  -0.615524 1.554832 -5.202515
H  1.956879 2.220436 -3.986059
H  2.710457 1.177993 -5.221005
H  3.067353 0.92778 -3.491842
C  -0.806895 -0.042192 3.675557
C  -0.148625 -1.209433 4.124563
C  -0.571846 1.170238 4.360649
C  0.717571 -1.162271 5.192431
H  -0.302109 -2.154345 3.621924
C  0.280518 1.214875 5.440658
H  -1.074789 2.077837 4.058015
C  0.934729 0.050078 5.860503
H  1.229673 -2.056616 5.524563
H  0.449091 2.144731 5.969166
C  1.827641 0.096649 6.982673
C  2.575524 0.133927 7.92031
H  3.241294 0.168544 8.757406
totalener: -1137.89501645034306 hartree
nucrepener: 1533.22930014413009 hartree
electener: -2671.04197206538629 hartree
oneelecener: -4630.19285155926354 hartree
twoeener: 1959.15087949387726 hartree
cpcmener: -0.07521419915207 hartree
kineticenergy: 1043.48511761477948 hartree
exchangeener: -87.721930852229 hartree
dispersion: -0.107591778 hartree
dispersion: -0.108412941 hartree
dispersion: -0.108540559 hartree
dispersion: -0.108629553 hartree
dispersion: -0.108618683 hartree
dispersion: -0.108699072 hartree
dispersion: -0.108653315 hartree
dispersion: -0.108752546 hartree
dispersion: -0.108672399 hartree
dispersion: -0.108805427 hartree
dispersion: -0.108680892 hartree
dispersion: -0.108862282 hartree
dispersion: -0.108679842 hartree
dispersion: -0.108923362 hartree
dispersion: -0.108670862 hartree
dispersion: -0.109027751 hartree
dispersion: -0.108866668 hartree
dispersion: -0.108876216 hartree
dispersion: -0.109032760 hartree
dispersion: -0.109034153 hartree
dispersion: -0.109054497 hartree
dispersion: -0.109063196 hartree
dispersion: -0.109064143 hartree
dispersion: -0.109060566 hartree
dispersion: -0.109054541 hartree
dispersion: -0.109048398 hartree
dispersion: -0.109046077 hartree
dispersion: -0.109049809 hartree
dispersion: -0.109055753 hartree
dispersion: -0.109058366 hartree
dispersion: -0.109058807 hartree
elementType: C H Au P
energy: -2098.2646 -282.7295 -281.7064 -281.0252 -280.9324 -280.9311 -280.5752 -280.5702 -280.3790 -280.3786 -280.3183 -280.2352 -280.1834 -279.8581 -279.6835 -279.6827 -279.6782 -279.5607 -182.0490 -131.7883 -131.7876 -131.7407 -116.3120 -67.0343 -66.5751 -66.5709 -28.8238 -27.8597 -26.1550 -25.2863 -25.1952 -24.8481 -24.5855 -23.9049 -22.8312 -22.8266 -21.9418 -21.4096 -20.6583 -19.6473 -19.1748 -18.6294 -18.2704 -17.4479 -17.1124 -16.8405 -16.3011 -15.7317 -15.6593 -15.5549 -15.4129 -15.1259 -15.1232 -14.9547 -14.7654 -14.6168 -14.2709 -14.2684 -14.0392 -13.9293 -13.7762 -13.5432 -13.3331 -13.0524 -12.6159 -12.5757 -12.3747 -12.1946 -11.7038 -11.2949 -11.2594 -11.2055 -11.1941 -10.6269 -10.2660 -9.9148 -9.4509 -9.1547 -2.1347 0.9834 1.0788 1.2834 1.3358 2.2744 2.6765 2.8886 2.9863 3.4132 3.5986 electronvolt
chargesum: 1.0000000
charge: -0.183558 0.150264 0.154252 -0.262337 -0.223475 0.135909 -0.151772 0.146444 0.158839 0.256645 -0.229161 0.166966 0.169110 0.019973 0.643845 -0.587970 -0.589615 -0.594229 0.173840 0.162583 0.173775 0.173920 0.162267 0.173791 0.173763 0.162425 0.173787 0.337042 -0.241769 -0.260373 -0.244808 0.153531 -0.231596 0.150694 0.171622 0.146654 0.146948 0.026641 -0.087621 0.222751
charge: -0.199342 0.143675 0.143551 -0.406988 -0.183330 0.140033 -0.152428 0.144655 0.162874 0.098310 -0.147905 0.144838 0.162621 0.208647 0.625273 -0.439795 -0.439853 -0.439754 0.123776 0.118201 0.123719 0.123770 0.118128 0.123735 0.123800 0.118181 0.123623 -0.103169 -0.016872 -0.017086 -0.060178 0.160069 -0.060144 0.158808 -0.086197 0.158518 0.158551 -0.062064 -0.026486 0.134234
qa: -0.1836 0.1503 0.1543 -0.2623 -0.2235 0.1359 -0.1518 0.1464 0.1588 0.2566 -0.2292 0.1670 0.1691 0.0200 0.6438 -0.5880 -0.5896 -0.5942 0.1738 0.1626 0.1738 0.1739 0.1623 0.1738 0.1738 0.1624 0.1738 0.3370 -0.2418 -0.2604 -0.2448 0.1535 -0.2316 0.1507 0.1716 0.1467 0.1469 0.0266 -0.0876 0.2228
va: 3.9344 0.9491 0.9467 3.7918 3.9967 0.9489 3.8633 0.9646 0.9612 3.7538 3.9377 0.9557 0.9556 1.6444 4.0225 3.8368 3.8377 3.8373 0.9555 0.9586 0.9555 0.9551 0.9586 0.9555 0.9556 0.9585 0.9553 3.7035 3.9113 3.9104 3.9122 0.9680 3.8993 0.9668 3.8181 0.9721 0.9717 3.4153 3.2891 0.9625
dispersion: -0.109057862 hartree
energy: -1138.004885097030 hartree
dipole: 14.680898175 -14.974972156 -0.294073982 -2.656976760 2.358889759 -0.298087000 269.892480530 -267.808405577 2.084074952
dipolemethod: SCF
magnitude: 2.125724294 au
magnitude: 5.403161758 debye
temp: 298.15 k
press: 1.00 atm
zeropoint: 0.33164526 hartree
thermalvibcorrection: 0.01880232 hartree
thermalrotcorrection: 0.00141627 hartree
thermaltrasncorrection: 0.00141627 hartree
thermaltotal: -1137.65160498 hartree
thermalcorr: 0.02163486 hartree
nonthermalcorr: 0.33164526 hartree
totalcorr: 0.35328012 hartree
thermalcorrenthalpy: 0.00094421 hartree
totalenthalpy: -1137.65066077 hartree
vibrat: 0.03486055 hartree
rotat: 0.01688694 hartree
transl: 0.02101176 hartree
total: 0.07275925 hartree
totalentropycorr: -0.07275925 hartree
gibbsenthalpy: -1137.72342001 hartree
gibbsminuselec: 0.28146508 hartree
