program: Orca
programVersion: 6.1.x
elementType: C H H C C H C H H C C H H Au P C C C H H H H H H H H H C C C C H C H C H H C C C H H H H H
elementType: Au
keywords: opt freq wb97x-d3bj def2-tzvp(-f) def2/J tightopt verytightscf
charge: 1
multiplicity: 1
frequency: 0.00 0.00 0.00 0.00 0.00 0.00 12.11 16.34 30.06 40.50 43.16 54.80 89.30 114.39 123.10 155.53 163.77 174.29 181.51 182.37 197.68 217.88 219.38 223.78 251.14 254.44 258.76 293.36 305.03 364.51 383.49 421.52 436.73 448.30 467.54 487.69 567.55 588.17 617.18 657.49 685.67 705.02 752.12 768.04 774.36 777.76 778.05 807.13 809.27 844.26 856.25 866.45 872.03 872.62 873.07 892.31 917.22 938.91 949.51 959.09 972.78 973.17 976.40 982.53 995.45 1002.21 1011.38 1031.46 1047.08 1065.71 1072.00 1078.44 1090.96 1103.53 1122.04 1141.44 1149.90 1162.14 1204.27 1214.50 1221.35 1231.06 1254.21 1255.78 1288.55 1310.18 1332.76 1335.95 1336.12 1348.79 1352.90 1369.39 1390.89 1418.43 1423.61 1444.37 1447.00 1447.48 1454.33 1454.93 1459.99 1460.91 1472.93 1476.02 1487.34 1522.74 1524.39 1586.87 1651.53 1698.55 3044.99 3073.34 3074.01 3074.25 3102.59 3139.32 3154.14 3158.97 3163.75 3163.78 3164.63 3165.31 3170.32 3170.51 3170.70 3179.44 3196.19 3198.92 3199.86 3215.47 3217.67 3242.97 3251.15 3255.15 3276.37
frequency: 12.11 16.34 30.06 40.50 43.16 54.80 89.30 114.39 123.10 155.53 163.77 174.29 181.51 182.37 197.68 217.88 219.38 223.78 251.14 254.44 258.76 293.36 305.03 364.51 383.49 421.52 436.73 448.30 467.54 487.69 567.55 588.17 617.18 657.49 685.67 705.02 752.12 768.04 774.36 777.76 778.05 807.13 809.27 844.26 856.25 866.45 872.03 872.62 873.07 892.31 917.22 938.91 949.51 959.09 972.78 973.17 976.40 982.53 995.45 1002.21 1011.38 1031.46 1047.08 1065.71 1072.00 1078.44 1090.96 1103.53 1122.04 1141.44 1149.90 1162.14 1204.27 1214.50 1221.35 1231.06 1254.21 1255.78 1288.55 1310.18 1332.76 1335.95 1336.12 1348.79 1352.90 1369.39 1390.89 1418.43 1423.61 1444.37 1447.00 1447.48 1454.33 1454.93 1459.99 1460.91 1472.93 1476.02 1487.34 1522.74 1524.39 1586.87 1651.53 1698.55 3044.99 3073.34 3074.01 3074.25 3102.59 3139.32 3154.14 3158.97 3163.75 3163.78 3164.63 3165.31 3170.32 3170.51 3170.70 3179.44 3196.19 3198.92 3199.86 3215.47 3217.67 3242.97 3251.15 3255.15 3276.37
formula: C18H25AuP
InChI: InChI=1/C15H16.C3H9P.Au/c1-2-14-10-15(14,9-1)13-7-5-12(6-8-13)11-3-4-11;1-4(2)3;/h5-8,11,14H,1,3-4,9-10H2;1-3H3;/rC18H25AuP/c1-20(2,3)19-17-10-11-18(12-16(17)18)15-8-6-14(7-9-15)13-4-5-13/h6-9,13,16H,4-5,10-12H2,1-3H3
45 atoms
C  -1.176032 2.152563 -0.144907
H  -2.120699 1.90157 -0.628769
H  -0.85621 3.103988 -0.595377
C  -0.118074 1.15466 -0.473614
C  0.747379 0.992716 0.61249
H  1.44288 0.170642 0.701351
C  1.208196 2.323906 1.311585
H  2.175816 2.188208 1.777549
H  1.081115 3.229094 0.73126
C  0.056741 1.67085 1.891341
C  -1.276748 2.20097 1.386899
H  -2.085018 1.551533 1.725954
H  -1.46123 3.205752 1.772648
Au -0.005068 0.134721 -2.230967
P  0.127484 -1.020188 -4.236931
C  1.128143 -0.170041 -5.483084
C  0.865499 -2.665129 -4.07781
C  -1.477841 -1.296044 -5.025936
H  -1.95337 -0.33465 -5.228829
H  -1.346114 -1.842761 -5.962531
H  -2.118388 -1.871764 -4.35528
H  0.696504 0.811193 -5.688955
H  1.156276 -0.756569 -6.404354
H  2.143389 -0.036592 -5.104981
H  1.877611 -2.572484 -3.67954
H  0.900852 -3.156255 -5.053023
H  0.269066 -3.266074 -3.38888
C  0.134142 0.944803 3.189142
C  -0.658553 -0.183663 3.407975
C  0.968887 1.380386 4.212717
C  -0.612032 -0.860146 4.61511
H  -1.310934 -0.541354 2.617553
C  1.01097 0.702911 5.42602
H  1.584726 2.261789 4.069201
C  0.225528 -0.426648 5.648534
H  -1.234631 -1.73805 4.751055
H  1.664389 1.060123 6.21578
C  0.300108 -1.127721 6.959355
C  -0.926071 -1.765873 7.564882
C  0.176855 -2.629979 7.038529
H  0.990944 -0.672694 7.659681
H  -1.844514 -1.711283 6.991809
H  -1.047645 -1.687246 8.638642
H  0.810846 -3.143375 7.751571
H  0.005437 -3.159865 6.108572
totalener: -1178.50982887934288 hartree
nucrepener: 1721.28888808403690 hartree
electener: -2899.71633417206385 hartree
oneelecener: -5058.23915041754208 hartree
twoeener: 2158.52281624547823 hartree
cpcmener: -0.07193252420960 hartree
kineticenergy: 1083.81586901891546 hartree
exchangeener: -91.993852957837 hartree
dispersion: -0.114608602 hartree
dispersion: -0.115774080 hartree
dispersion: -0.115534863 hartree
dispersion: -0.115668192 hartree
dispersion: -0.115731752 hartree
dispersion: -0.115737766 hartree
dispersion: -0.115726726 hartree
dispersion: -0.115717333 hartree
elementType: C H Au P
energy: -2098.5027 -281.7484 -281.2262 -280.8126 -280.6956 -280.1772 -280.1695 -280.1551 -280.0151 -279.9331 -279.9003 -279.8956 -279.8305 -279.8238 -279.8232 -279.7681 -279.7366 -279.6431 -279.6356 -182.2920 -132.0294 -132.0288 -131.9873 -116.9030 -67.6595 -67.1783 -67.1086 -29.2469 -27.8420 -27.0732 -25.4868 -25.3664 -24.7048 -24.2838 -23.6127 -22.9826 -22.9801 -21.6567 -20.9944 -20.2806 -19.9202 -19.3340 -18.9188 -18.8184 -18.6497 -17.9866 -17.1567 -16.5216 -16.2983 -16.0046 -15.6579 -15.4981 -15.2778 -15.2703 -15.1771 -14.8518 -14.6504 -14.5782 -14.4205 -14.4099 -14.2071 -13.9335 -13.9147 -13.8230 -13.5789 -13.0451 -12.9068 -12.8559 -12.7480 -12.6696 -12.3712 -12.1574 -11.9641 -11.7724 -11.7325 -11.7178 -11.6342 -11.1074 -11.0749 -10.2969 -10.1600 -9.8421 -8.9404 -0.9388 1.1395 1.3677 1.5039 1.7158 2.2141 2.8775 3.3067 3.5136 3.5713 3.6954 electronvolt
chargesum: 1.0000000
charge: -0.234657 0.163811 0.180042 -0.096974 -0.098052 0.150839 -0.175643 0.167170 0.148368 0.199171 -0.261391 0.139428 0.136877 0.090351 0.653267 -0.586895 -0.591336 -0.592042 0.176897 0.167440 0.177090 0.177190 0.167608 0.177247 0.176858 0.167625 0.177179 0.342192 -0.317913 -0.277488 -0.283898 0.131847 -0.336836 0.131164 0.359809 0.133953 0.118806 -0.147777 -0.200534 -0.202096 0.111282 0.122422 0.117828 0.117843 0.121929
charge: -0.204657 0.151660 0.170066 -0.182560 -0.126195 0.156660 -0.061238 0.151112 0.146297 -0.124092 -0.148966 0.141245 0.140435 0.281708 0.635717 -0.434932 -0.435117 -0.435269 0.125671 0.120751 0.125659 0.125711 0.120915 0.125773 0.125710 0.120778 0.125710 -0.110449 -0.090032 -0.091816 -0.100633 0.148021 -0.104861 0.148075 -0.113753 0.147321 0.145220 -0.167848 -0.192533 -0.192762 0.144269 0.123983 0.122739 0.122652 0.123856
qa: -0.2347 0.1638 0.1800 -0.0970 -0.0981 0.1508 -0.1756 0.1672 0.1484 0.1992 -0.2614 0.1394 0.1369 0.0904 0.6533 -0.5869 -0.5913 -0.5920 0.1769 0.1674 0.1771 0.1772 0.1676 0.1772 0.1769 0.1676 0.1772 0.3422 -0.3179 -0.2775 -0.2839 0.1318 -0.3368 0.1312 0.3598 0.1340 0.1188 -0.1478 -0.2005 -0.2021 0.1113 0.1224 0.1178 0.1178 0.1219
va: 3.9293 0.9531 0.9579 3.5116 3.8612 0.9477 3.9921 0.9632 0.9552 3.7470 4.0268 0.9669 0.9685 1.6969 4.0293 3.8442 3.8423 3.8413 0.9549 0.9576 0.9546 0.9545 0.9574 0.9546 0.9550 0.9576 0.9546 3.6159 3.9660 3.8472 3.8082 0.9687 3.8928 0.9688 3.7127 0.9779 0.9743 3.7564 3.8853 3.8854 0.9567 0.9710 0.9731 0.9730 0.9710
dispersion: -0.115714860 hartree
energy: -1178.626503422724 hartree
dipole: 2.628706586 -2.450923536 0.177783050 -21.344052133 21.697258757 0.353206624 326.356431162 -328.745589010 -2.389157848
dipolemethod: SCF
magnitude: 2.421659959 au
magnitude: 6.155370440 debye
temp: 298.15 k
press: 1.00 atm
zeropoint: 0.38460602 hartree
thermalvibcorrection: 0.01971267 hartree
thermalrotcorrection: 0.00141627 hartree
thermaltrasncorrection: 0.00141627 hartree
thermaltotal: -1178.21935219 hartree
thermalcorr: 0.02254521 hartree
nonthermalcorr: 0.38460602 hartree
totalcorr: 0.40715123 hartree
thermalcorrenthalpy: 0.00094421 hartree
totalenthalpy: -1178.21840798 hartree
vibrat: 0.03595645 hartree
rotat: 0.01705896 hartree
transl: 0.02106102 hartree
total: 0.07407643 hartree
totalentropycorr: -0.07407643 hartree
gibbsenthalpy: -1178.29248441 hartree
gibbsminuselec: 0.33401901 hartree
