program: Orca
programVersion: 6.1.x
elementType: C H H C C H C H H C C H H Au P C C C H H H H H H H H H C C C C H C H C H H N O O
elementType: Au
keywords: opt freq wb97x-d3bj def2-tzvp(-f) def2/J tightopt verytightscf
charge: 1
multiplicity: 1
frequency: 0.00 0.00 0.00 0.00 0.00 0.00 13.61 16.47 17.43 35.49 43.14 47.99 67.06 117.56 121.03 154.66 161.95 179.14 182.42 196.08 202.91 218.87 221.06 226.36 253.44 260.03 278.00 291.52 346.57 364.40 396.83 423.28 441.80 465.12 514.27 534.86 547.33 630.25 646.97 699.69 705.44 728.47 733.26 776.03 778.25 779.58 794.12 807.72 858.82 864.95 872.25 873.53 880.25 893.33 904.60 914.38 951.38 973.46 973.59 978.67 983.99 993.35 1014.42 1019.52 1030.09 1044.74 1074.40 1103.21 1120.90 1137.38 1147.54 1164.26 1207.12 1230.64 1248.58 1289.33 1314.50 1332.85 1336.24 1336.58 1341.97 1349.25 1364.97 1378.55 1415.29 1439.09 1444.53 1446.70 1447.38 1451.87 1454.65 1455.07 1460.71 1467.92 1487.47 1519.42 1562.56 1612.98 1687.43 1689.67 3048.73 3073.73 3074.35 3074.50 3104.53 3134.34 3155.40 3164.45 3164.88 3165.47 3170.61 3170.86 3171.26 3182.05 3220.17 3228.40 3252.85 3258.94 3259.93 3279.08
frequency: 13.61 16.47 17.43 35.49 43.14 47.99 67.06 117.56 121.03 154.66 161.95 179.14 182.42 196.08 202.91 218.87 221.06 226.36 253.44 260.03 278.00 291.52 346.57 364.40 396.83 423.28 441.80 465.12 514.27 534.86 547.33 630.25 646.97 699.69 705.44 728.47 733.26 776.03 778.25 779.58 794.12 807.72 858.82 864.95 872.25 873.53 880.25 893.33 904.60 914.38 951.38 973.46 973.59 978.67 983.99 993.35 1014.42 1019.52 1030.09 1044.74 1074.40 1103.21 1120.90 1137.38 1147.54 1164.26 1207.12 1230.64 1248.58 1289.33 1314.50 1332.85 1336.24 1336.58 1341.97 1349.25 1364.97 1378.55 1415.29 1439.09 1444.53 1446.70 1447.38 1451.87 1454.65 1455.07 1460.71 1467.92 1487.47 1519.42 1562.56 1612.98 1687.43 1689.67 3048.73 3073.73 3074.35 3074.50 3104.53 3134.34 3155.40 3164.45 3164.88 3165.47 3170.61 3170.86 3171.26 3182.05 3220.17 3228.40 3252.85 3258.94 3259.93 3279.08
formula: C15H20AuNO2P
InChI: InChI=1/C12H11NO2.C3H9P.Au/c14-13(15)11-5-3-9(4-6-11)12-7-1-2-10(12)8-12;1-4(2)3;/h3-6,10H,1,7-8H2;1-3H3;/rC15H20AuNO2P/c1-20(2,3)16-14-8-9-15(10-13(14)15)11-4-6-12(7-5-11)17(18)19/h4-7,13H,8-10H2,1-3H3
40 atoms
C  -1.907784 -1.442692 -0.042501
H  -1.599234 -2.396874 -0.473325
H  -2.869676 -1.206717 -0.521239
C  -0.967013 -0.359423 -0.436237
C  -0.794701 0.534472 0.634737
H  0.008329 1.255572 0.684993
C  -2.153234 1.016358 1.268024
H  -2.047272 2.013346 1.676317
H  -3.048435 0.831342 0.688275
C  -1.470337 -0.086325 1.917958
C  -1.96543 -1.46118 1.493299
H  -1.298856 -2.232343 1.882289
H  -2.968979 -1.648923 1.879408
Au -0.056791 -0.220598 -2.248163
P  0.969277 -0.05093 -4.321422
C  0.002874 0.909035 -5.513038
C  2.588817 0.754452 -4.263193
C  1.261282 -1.647631 -5.121183
H  0.309808 -2.163744 -5.261965
H  1.742235 -1.49823 -6.090649
H  1.904391 -2.25978 -4.486193
H  -0.96992 0.435554 -5.657877
H  0.530492 0.958229 -6.468409
H  -0.149546 1.919131 -5.128437
H  2.478524 1.76358 -3.86184
H  3.017574 0.805988 -5.266713
H  3.255008 0.186229 -3.611456
C  -0.779258 0.082341 3.229162
C  0.39615 -0.626141 3.48389
C  -1.304726 0.919126 4.210299
C  1.04613 -0.499247 4.698949
H  0.810504 -1.274761 2.720162
C  -0.667641 1.056049 5.435429
H  -2.222184 1.464254 4.022541
C  0.498191 0.343593 5.654572
H  1.960824 -1.038273 4.904347
H  -1.069105 1.701189 6.205009
N  1.184093 0.48516 6.951537
O  0.686277 1.220447 7.783588
O  2.213613 -0.140746 7.123307
totalener: -1266.31803752081896 hartree
nucrepener: 1733.52398520953034 hartree
electener: -2999.75156781242322 hartree
oneelecener: -5204.90493931357651 hartree
twoeener: 2205.15337150115329 hartree
cpcmener: -0.08361368127357 hartree
kineticenergy: 1171.70203718390280 hartree
exchangeener: -96.695765016909 hartree
dispersion: -0.106434148 hartree
dispersion: -0.107495034 hartree
dispersion: -0.107234923 hartree
dispersion: -0.107328175 hartree
dispersion: -0.107615342 hartree
dispersion: -0.107398181 hartree
dispersion: -0.107405183 hartree
dispersion: -0.107410365 hartree
dispersion: -0.107406328 hartree
dispersion: -0.107403508 hartree
dispersion: -0.107398877 hartree
dispersion: -0.107399163 hartree
dispersion: -0.107401684 hartree
dispersion: -0.107403484 hartree
dispersion: -0.107404294 hartree
dispersion: -0.107403584 hartree
elementType: C H Au P N O
energy: -2098.5427 -524.1816 -524.1810 -399.2566 -281.9652 -281.5656 -281.2957 -280.9532 -280.8249 -280.8053 -280.5187 -280.5120 -280.3355 -280.3316 -280.2663 -280.1225 -279.8595 -279.8523 -279.8513 -182.3324 -132.0694 -132.0689 -132.0283 -116.9836 -67.7430 -67.2595 -67.1850 -37.8883 -32.9411 -29.4558 -28.3242 -26.2310 -25.4260 -25.3843 -24.9183 -24.1211 -23.0126 -23.0091 -22.8767 -21.6131 -20.7809 -20.2107 -19.2248 -19.0633 -18.9740 -18.7561 -18.4761 -17.9924 -17.7963 -16.5886 -16.4353 -16.1256 -15.8646 -15.5606 -15.3554 -15.3028 -15.3003 -14.9909 -14.7735 -14.4716 -14.4427 -14.3637 -14.0791 -13.9820 -13.9429 -13.7038 -13.1450 -12.9667 -12.8760 -12.7771 -12.2668 -12.0851 -11.9784 -11.9112 -11.8162 -11.7988 -11.7253 -11.5847 -11.5013 -10.5125 -10.3303 -10.3150 -9.9315 -1.1489 -0.4867 1.0950 1.1199 1.4774 1.9937 2.1734 2.8214 3.2555 3.4633 3.6134 electronvolt
chargesum: 1.0000000
charge: -0.242458 0.170794 0.184923 -0.081858 -0.093677 0.154953 -0.177560 0.170636 0.151391 0.194595 -0.255712 0.141478 0.138404 0.098702 0.653816 -0.586603 -0.591301 -0.592015 0.177232 0.168161 0.177429 0.177532 0.168266 0.177436 0.177158 0.168380 0.177510 0.405344 -0.290287 -0.310914 -0.198605 0.143827 -0.175583 0.143836 0.239525 0.147324 0.148268 0.509182 -0.384479 -0.385046
charge: -0.202427 0.156842 0.172952 -0.168005 -0.124713 0.158838 -0.053252 0.151996 0.147179 -0.134578 -0.145642 0.142107 0.141062 0.288538 0.636596 -0.434422 -0.434639 -0.434764 0.125845 0.121108 0.125894 0.125972 0.121281 0.125949 0.125922 0.121146 0.125861 -0.074258 -0.069928 -0.071444 -0.072003 0.154819 -0.069947 0.154723 -0.123161 0.155396 0.155750 0.025251 -0.073701 -0.074141
qa: -0.2425 0.1708 0.1849 -0.0819 -0.0937 0.1550 -0.1776 0.1706 0.1514 0.1946 -0.2557 0.1415 0.1384 0.0987 0.6538 -0.5866 -0.5913 -0.5920 0.1772 0.1682 0.1774 0.1775 0.1683 0.1774 0.1772 0.1684 0.1775 0.4053 -0.2903 -0.3109 -0.1986 0.1438 -0.1756 0.1438 0.2395 0.1473 0.1483 0.5092 -0.3845 -0.3850
va: 3.9416 0.9524 0.9561 3.4835 3.8553 0.9460 3.9911 0.9602 0.9560 3.7624 4.0318 0.9653 0.9680 1.7033 4.0314 3.8448 3.8426 3.8418 0.9548 0.9575 0.9545 0.9545 0.9574 0.9546 0.9549 0.9575 0.9544 3.5779 3.9477 3.9437 3.8983 0.9658 3.8954 0.9667 3.8174 0.9944 0.9938 4.2982 1.9373 1.9362
dispersion: -0.107402446 hartree
energy: -1266.426320811079 hartree
dipole: 6.982486440 -8.548927243 -1.566440804 22.717226105 -22.951206183 -0.233980078 303.025424009 -308.210899993 -5.185475984
dipolemethod: SCF
magnitude: 5.421959484 au
magnitude: 13.781525773 debye
temp: 298.15 k
press: 1.00 atm
zeropoint: 0.32423181 hartree
thermalvibcorrection: 0.01919695 hartree
thermalrotcorrection: 0.00141627 hartree
thermaltrasncorrection: 0.00141627 hartree
thermaltotal: -1266.08005951 hartree
thermalcorr: 0.02202949 hartree
nonthermalcorr: 0.32423181 hartree
totalcorr: 0.34626130 hartree
thermalcorrenthalpy: 0.00094421 hartree
totalenthalpy: -1266.07911530 hartree
vibrat: 0.03539217 hartree
rotat: 0.01704082 hartree
transl: 0.02107582 hartree
total: 0.07350881 hartree
totalentropycorr: -0.07350881 hartree
gibbsenthalpy: -1266.15262411 hartree
gibbsminuselec: 0.27369670 hartree
