program: Orca
programVersion: 6.1.x
elementType: C H H C C H C H H C C H H Au P C C C H H H H H H H H H C C C C H C H C F F F
elementType: Au
keywords: opt freq wb97x-d3bj def2-tzvp(-f) def2/J tightopt verytightscf
charge: 1
multiplicity: 1
frequency: 0.00 0.00 0.00 0.00 0.00 0.00 9.82 17.47 19.37 40.70 46.39 80.69 120.45 125.46 154.51 160.28 164.94 183.58 193.24 210.18 215.10 221.14 222.72 252.60 257.81 261.42 278.73 281.37 294.44 322.31 365.48 371.99 399.85 451.25 455.33 520.30 544.43 585.74 615.30 639.62 666.12 700.38 706.29 737.73 748.00 776.81 779.33 779.90 809.80 833.86 870.55 873.66 874.84 891.28 907.86 915.84 951.85 964.40 974.30 974.74 981.66 988.87 994.43 1040.12 1063.89 1079.19 1105.81 1116.75 1157.64 1230.82 1233.37 1242.90 1251.78 1270.61 1301.98 1326.18 1337.37 1338.08 1350.56 1351.37 1367.04 1400.09 1423.84 1444.63 1447.40 1447.73 1454.89 1455.06 1461.37 1465.50 1486.30 1491.58 1525.35 1587.99 1684.48 1709.45 3047.57 3073.58 3074.17 3074.46 3104.29 3136.40 3155.47 3164.56 3164.71 3165.36 3170.32 3170.57 3171.19 3182.32 3232.26 3240.52 3252.55 3279.20
frequency: 9.82 17.47 19.37 40.70 46.39 80.69 120.45 125.46 154.51 160.28 164.94 183.58 193.24 210.18 215.10 221.14 222.72 252.60 257.81 261.42 278.73 281.37 294.44 322.31 365.48 371.99 399.85 451.25 455.33 520.30 544.43 585.74 615.30 639.62 666.12 700.38 706.29 737.73 748.00 776.81 779.33 779.90 809.80 833.86 870.55 873.66 874.84 891.28 907.86 915.84 951.85 964.40 974.30 974.74 981.66 988.87 994.43 1040.12 1063.89 1079.19 1105.81 1116.75 1157.64 1230.82 1233.37 1242.90 1251.78 1270.61 1301.98 1326.18 1337.37 1338.08 1350.56 1351.37 1367.04 1400.09 1423.84 1444.63 1447.40 1447.73 1454.89 1455.06 1461.37 1465.50 1486.30 1491.58 1525.35 1587.99 1684.48 1709.45 3047.57 3073.58 3074.17 3074.46 3104.29 3136.40 3155.47 3164.56 3164.71 3165.36 3170.32 3170.57 3171.19 3182.32 3232.26 3240.52 3252.55 3279.20
formula: C15H18F3AuP
InChI: InChI=1/C12H9F3.C3H9P.Au/c13-9-4-8(5-10(14)11(9)15)12-3-1-2-7(12)6-12;1-4(2)3;/h4-5,7H,1,3,6H2;1-3H3;/rC15H18AuF3P/c1-20(2,3)16-11-4-5-15(8-10(11)15)9-6-12(17)14(19)13(18)7-9/h6-7,10H,4-5,8H2,1-3H3
38 atoms
C  -1.680817 -1.64883 0.075361
H  -1.275099 -2.536489 -0.412541
H  -2.697049 -1.532849 -0.330013
C  -0.928725 -0.429824 -0.329397
C  -0.832195 0.454932 0.757134
H  -0.141194 1.284951 0.78857
C  -2.194761 0.7033 1.50213
H  -2.210054 1.690525 1.945798
H  -3.091917 0.403112 0.976094
C  -1.314615 -0.304878 2.0591
C  -1.630547 -1.723611 1.609343
H  -0.83348 -2.399525 1.922466
H  -2.566671 -2.070666 2.050694
Au -0.120466 -0.133408 -2.170867
P  0.806301 0.191598 -4.272164
C  -0.421202 0.214736 -5.601781
C  1.715646 1.747398 -4.436654
C  1.984843 -1.100542 -4.738122
H  1.480866 -2.068805 -4.73766
H  2.38652 -0.89898 -5.733911
H  2.801707 -1.127221 -4.014506
H  -0.961922 -0.733372 -5.613716
H  0.073901 0.364287 -6.564098
H  -1.132383 1.024432 -5.428382
H  1.042707 2.584397 -4.241251
H  2.125788 1.837148 -5.445209
H  2.529219 1.771801 -3.709163
C  -0.561911 -0.073001 3.325787
C  0.700131 -0.644978 3.484658
C  -1.117166 0.68709 4.349915
C  1.38817 -0.44419 4.661307
H  1.156872 -1.235881 2.699413
C  -0.403459 0.869447 5.519153
H  -2.100136 1.132623 4.258885
C  0.850886 0.312364 5.692291
F  -0.921235 1.595943 6.523813
F  1.532125 0.498464 6.828653
F  2.608916 -0.97745 4.837081
totalener: -1359.54043019252686 hartree
nucrepener: 1793.73639051456917 hartree
electener: -3153.19218015091292 hartree
oneelecener: -5461.34237924561785 hartree
twoeener: 2308.15019909470493 hartree
cpcmener: -0.07982063606889 hartree
kineticenergy: 1265.06043936364699 hartree
exchangeener: -101.768946664424 hartree
dispersion: -0.102344559 hartree
dispersion: -0.102464522 hartree
dispersion: -0.102368496 hartree
dispersion: -0.102317167 hartree
dispersion: -0.102376321 hartree
dispersion: -0.102372249 hartree
dispersion: -0.102371962 hartree
dispersion: -0.102372538 hartree
elementType: C H Au P F
energy: -2098.5383 -675.0325 -674.8892 -674.8818 -282.7758 -282.7642 -282.7456 -281.9444 -281.3527 -280.9464 -280.8969 -280.8201 -280.4158 -280.4033 -280.2587 -280.1234 -279.8531 -279.8520 -279.8460 -182.3280 -132.0649 -132.0646 -132.0241 -116.9758 -67.7350 -67.2518 -67.1776 -38.1211 -37.7553 -37.5480 -29.4638 -28.2645 -25.7733 -25.3998 -25.1306 -24.9662 -23.8292 -23.0062 -23.0059 -21.9208 -21.5827 -21.2042 -19.7976 -19.1614 -18.9961 -18.7689 -18.7438 -18.4719 -17.5124 -17.4784 -17.3649 -16.5538 -16.4205 -16.2968 -16.1146 -15.9363 -15.5292 -15.4522 -15.2993 -15.2939 -14.9262 -14.7347 -14.5228 -14.4379 -14.4287 -14.2296 -14.0174 -13.9377 -13.6882 -13.6342 -13.5625 -12.9289 -12.8567 -12.7635 -12.2506 -12.1199 -11.8312 -11.8001 -11.7021 -11.4760 -10.4173 -10.2931 -10.0587 -9.6745 -1.0566 1.0876 1.1761 1.3467 1.5959 2.1690 2.6432 2.8489 3.3124 3.5196 3.6563 electronvolt
chargesum: 1.0000000
charge: -0.238859 0.169320 0.184796 -0.082231 -0.104721 0.154669 -0.170696 0.169565 0.151542 0.228674 -0.257844 0.141698 0.138296 0.098352 0.653169 -0.588073 -0.592449 -0.588498 0.177327 0.168157 0.177551 0.177293 0.168115 0.177444 0.177255 0.168169 0.177200 0.333133 -0.370587 -0.384796 0.305137 0.151361 0.310215 0.151446 0.201662 -0.246848 -0.239138 -0.246801
charge: -0.202380 0.155624 0.173023 -0.169691 -0.124612 0.158711 -0.054510 0.152140 0.147444 -0.131717 -0.145745 0.142176 0.141225 0.287928 0.636506 -0.434416 -0.434867 -0.434578 0.125916 0.121159 0.125860 0.125930 0.121229 0.125851 0.125876 0.121056 0.125884 -0.084916 -0.057616 -0.058815 -0.144130 0.162221 -0.143935 0.162099 -0.131567 0.101382 0.113166 0.101087
qa: -0.2389 0.1693 0.1848 -0.0822 -0.1047 0.1547 -0.1707 0.1696 0.1515 0.2287 -0.2578 0.1417 0.1383 0.0984 0.6532 -0.5881 -0.5924 -0.5885 0.1773 0.1682 0.1776 0.1773 0.1681 0.1774 0.1773 0.1682 0.1772 0.3331 -0.3706 -0.3848 0.3051 0.1514 0.3102 0.1514 0.2017 -0.2468 -0.2391 -0.2468
va: 3.9378 0.9525 0.9565 3.4870 3.8673 0.9465 3.9790 0.9613 0.9555 3.7530 4.0251 0.9649 0.9681 1.7029 4.0317 3.8436 3.8418 3.8432 0.9547 0.9575 0.9542 0.9547 0.9574 0.9545 0.9549 0.9575 0.9547 3.5367 3.8990 3.8986 3.8324 0.9737 3.8430 0.9740 3.9264 1.0633 1.0789 1.0635
dispersion: -0.102372593 hartree
energy: -1359.642802655538 hartree
dipole: 12.748257564 -14.117826673 -1.369569109 11.291154449 -11.540116764 -0.248962314 274.297200484 -278.729926657 -4.432726172
dipolemethod: SCF
magnitude: 4.646155733 au
magnitude: 11.809589351 debye
temp: 298.15 k
press: 1.00 atm
zeropoint: 0.29683868 hartree
thermalvibcorrection: 0.01920520 hartree
thermalrotcorrection: 0.00141627 hartree
thermaltrasncorrection: 0.00141627 hartree
thermaltotal: -1359.32392624 hartree
thermalcorr: 0.02203774 hartree
nonthermalcorr: 0.29683868 hartree
totalcorr: 0.31887642 hartree
thermalcorrenthalpy: 0.00094421 hartree
totalenthalpy: -1359.32298203 hartree
vibrat: 0.03515754 hartree
rotat: 0.01704055 hartree
transl: 0.02110237 hartree
total: 0.07330046 hartree
totalentropycorr: -0.07330046 hartree
gibbsenthalpy: -1359.39628249 hartree
gibbsminuselec: 0.24652017 hartree
