program: Orca
programVersion: 6.1.x
elementType: C H H C C H C H H C C H H Au P C C C H H H H H H H H H C C C C H C H C N O O C N C N
elementType: Au
keywords: opt freq wb97x-d3bj def2-tzvp(-f) def2/J tightopt verytightscf
charge: 1
multiplicity: 1
frequency: 0.00 0.00 0.00 0.00 0.00 0.00 12.98 17.91 18.77 38.81 43.41 58.67 59.00 78.28 105.70 117.93 139.19 153.06 160.16 163.40 164.78 180.03 184.52 190.16 201.63 218.67 223.77 224.15 253.83 258.69 276.32 284.69 325.35 364.42 380.67 384.67 396.46 438.73 447.20 465.48 484.61 501.32 539.76 608.39 628.88 632.69 656.18 668.29 705.10 715.23 742.02 772.59 778.83 779.29 800.16 808.58 831.39 872.35 872.67 874.20 882.27 905.37 941.31 960.21 965.61 974.08 974.18 979.92 981.16 983.34 989.82 994.76 1039.51 1079.54 1104.95 1120.29 1157.94 1189.88 1230.27 1247.04 1255.40 1267.62 1319.90 1322.09 1336.63 1337.39 1338.82 1349.96 1363.47 1381.32 1412.01 1444.69 1447.31 1447.68 1451.26 1454.78 1455.23 1457.30 1461.20 1471.81 1488.91 1512.33 1534.61 1641.55 1677.08 1694.27 2404.16 2405.80 3046.47 3073.79 3074.57 3074.90 3104.81 3133.81 3156.27 3164.26 3165.36 3165.90 3170.76 3171.05 3171.88 3185.27 3237.53 3244.93 3252.53 3282.64
frequency: 12.98 17.91 18.77 38.81 43.41 58.67 59.00 78.28 105.70 117.93 139.19 153.06 160.16 163.40 164.78 180.03 184.52 190.16 201.63 218.67 223.77 224.15 253.83 258.69 276.32 284.69 325.35 364.42 380.67 384.67 396.46 438.73 447.20 465.48 484.61 501.32 539.76 608.39 628.88 632.69 656.18 668.29 705.10 715.23 742.02 772.59 778.83 779.29 800.16 808.58 831.39 872.35 872.67 874.20 882.27 905.37 941.31 960.21 965.61 974.08 974.18 979.92 981.16 983.34 989.82 994.76 1039.51 1079.54 1104.95 1120.29 1157.94 1189.88 1230.27 1247.04 1255.40 1267.62 1319.90 1322.09 1336.63 1337.39 1338.82 1349.96 1363.47 1381.32 1412.01 1444.69 1447.31 1447.68 1451.26 1454.78 1455.23 1457.30 1461.20 1471.81 1488.91 1512.33 1534.61 1641.55 1677.08 1694.27 2404.16 2405.80 3046.47 3073.79 3074.57 3074.90 3104.81 3133.81 3156.27 3164.26 3165.36 3165.90 3170.76 3171.05 3171.88 3185.27 3237.53 3244.93 3252.53 3282.64
formula: C17H18AuN3O2P
InChI: InChI=1/C14H9N3O2.C3H9P.Au/c15-7-9-4-12(14-3-1-2-11(14)6-14)5-10(8-16)13(9)17(18)19;1-4(2)3;/h4-5,11H,1,3,6H2;1-3H3;/rC17H18AuN3O2P/c1-24(2,3)18-15-4-5-17(8-14(15)17)13-6-11(9-19)16(21(22)23)12(7-13)10-20/h6-7,14H,4-5,8H2,1-3H3
42 atoms
C  -2.30636 -0.82537 -0.672323
H  -2.268607 -1.826428 -1.105982
H  -3.146622 -0.325661 -1.176839
C  -1.086968 -0.054994 -1.030357
C  -0.687121 0.738323 0.064491
H  0.29209 1.187577 0.1459
C  -1.858049 1.59816 0.66507
H  -1.476906 2.516562 1.093218
H  -2.755496 1.687892 0.066908
C  -1.547549 0.334247 1.312064
C  -2.414136 -0.832802 0.861216
H  -2.016309 -1.767952 1.258604
H  -3.439302 -0.717657 1.216922
Au -0.125848 -0.174063 -2.815581
P  0.977899 -0.325943 -4.850767
C  0.152357 0.582238 -6.180453
C  2.667195 0.320607 -4.807084
C  1.132173 -2.023778 -5.457384
H  0.137996 -2.456694 -5.582681
H  1.657204 -2.032383 -6.415379
H  1.68843 -2.620551 -4.732182
H  -0.857441 0.190655 -6.316178
H  0.714019 0.472914 -7.111079
H  0.089087 1.639097 -5.915112
H  2.646329 1.373413 -4.519643
H  3.13224 0.220223 -5.790535
H  3.250095 -0.235093 -4.070243
C  -0.874325 0.282904 2.641249
C  -1.159518 1.216881 3.626683
C  0.040798 -0.730355 2.907304
C  -0.526805 1.155454 4.868401
H  -1.882536 2.002603 3.446892
C  0.665581 -0.816944 4.146705
H  0.28487 -1.460727 2.145283
C  0.3808 0.135371 5.120866
N  1.046654 0.058532 6.431233
O  1.428959 1.100665 6.919738
O  1.165501 -1.042143 6.926653
C  -0.882396 2.138108 5.859996
N  -1.224182 2.939308 6.607832
C  1.626697 -1.870818 4.349474
N  2.392939 -2.721274 4.436668
totalener: -1450.88494311915065 hartree
nucrepener: 2174.50357250032494 hartree
electener: -3625.27296582059080 hartree
oneelecener: -6328.38293911606252 hartree
twoeener: 2703.10997329547172 hartree
cpcmener: -0.11271990150043 hartree
kineticenergy: 1355.56303558958211 hartree
exchangeener: -112.538213356332 hartree
dispersion: -0.118629526 hartree
dispersion: -0.119727420 hartree
dispersion: -0.119452382 hartree
dispersion: -0.119529808 hartree
dispersion: -0.119783067 hartree
dispersion: -0.119596098 hartree
dispersion: -0.119613432 hartree
dispersion: -0.119622498 hartree
dispersion: -0.119618346 hartree
dispersion: -0.119613383 hartree
dispersion: -0.119606592 hartree
dispersion: -0.119604672 hartree
dispersion: -0.119605651 hartree
dispersion: -0.119608789 hartree
dispersion: -0.119619211 hartree
dispersion: -0.119615860 hartree
dispersion: -0.119614443 hartree
dispersion: -0.119613293 hartree
dispersion: -0.119612912 hartree
elementType: C H Au P N O
energy: -2098.5774 -524.8265 -524.8254 -399.9218 -393.0105 -393.0050 -282.8836 -282.2770 -282.2742 -282.1294 -281.5956 -281.5865 -281.5142 -281.4514 -281.3528 -281.3404 -281.0974 -280.9732 -280.3744 -280.2641 -279.8839 -279.8767 -279.8734 -182.3671 -132.1039 -132.1036 -132.0635 -117.0511 -67.8126 -67.3277 -67.2494 -38.5914 -33.6889 -29.9720 -29.5607 -29.3827 -28.9508 -27.0260 -26.5433 -25.6402 -25.4304 -24.6060 -23.6666 -23.0370 -23.0334 -22.6889 -21.7030 -21.6261 -20.6570 -19.5665 -19.3268 -19.1083 -18.8983 -18.6611 -18.5123 -17.7877 -17.7328 -17.5381 -16.5280 -16.4383 -15.8483 -15.7333 -15.3925 -15.3269 -15.3235 -14.9769 -14.6226 -14.4998 -14.4971 -14.4139 -14.3416 -14.2320 -14.1526 -13.9907 -13.9661 -13.8003 -13.6143 -13.4146 -13.1824 -12.9733 -12.9435 -12.8312 -12.4434 -12.3852 -12.2439 -12.2348 -12.1875 -11.8966 -11.8684 -11.7947 -11.6973 -10.8337 -10.7860 -10.3799 -10.2234 -1.4256 -0.9122 -0.5074 0.6284 1.0596 1.4437 2.0987 2.3599 2.6975 2.7590 2.8391 electronvolt
chargesum: 1.0000000
charge: -0.248959 0.174620 0.189232 -0.071671 -0.089196 0.158197 -0.176204 0.175304 0.152810 0.126679 -0.258489 0.145162 0.142438 0.104484 0.653495 -0.586816 -0.592033 -0.590161 0.177499 0.168923 0.177864 0.177645 0.168901 0.177609 0.177320 0.168918 0.177752 0.490034 -0.457340 -0.437985 0.550500 0.171076 0.538130 0.170417 -0.041389 0.557581 -0.354175 -0.354385 -0.235046 -0.169974 -0.238376 -0.170390
charge: -0.199947 0.159498 0.175326 -0.159749 -0.122560 0.160807 -0.049444 0.153536 0.148755 -0.136479 -0.142310 0.143643 0.142416 0.293346 0.637225 -0.433923 -0.434333 -0.434192 0.126041 0.121475 0.126047 0.126110 0.121609 0.126066 0.125980 0.121399 0.126088 -0.055062 0.022904 0.026211 -0.088284 0.173046 -0.089601 0.173619 -0.013952 0.025833 -0.024797 -0.024945 -0.070992 -0.002179 -0.071067 -0.003163
qa: -0.2490 0.1746 0.1892 -0.0717 -0.0892 0.1582 -0.1762 0.1753 0.1528 0.1267 -0.2585 0.1452 0.1424 0.1045 0.6535 -0.5868 -0.5920 -0.5902 0.1775 0.1689 0.1779 0.1776 0.1689 0.1776 0.1773 0.1689 0.1778 0.4900 -0.4573 -0.4380 0.5505 0.1711 0.5381 0.1704 -0.0414 0.5576 -0.3542 -0.3544 -0.2350 -0.1700 -0.2384 -0.1704
va: 3.9570 0.9520 0.9546 3.4662 3.8610 0.9452 3.9982 0.9570 0.9558 3.7996 4.0340 0.9634 0.9668 1.7094 4.0343 3.8453 3.8423 3.8424 0.9547 0.9574 0.9542 0.9546 0.9573 0.9545 0.9548 0.9574 0.9544 3.5121 3.9342 3.9549 3.5631 0.9633 3.5486 0.9631 4.0523 4.1980 1.9569 1.9564 3.9227 3.1472 3.9264 3.1488
dispersion: -0.119613302 hartree
energy: -1451.005610740351 hartree
dipole: 12.780704040 -15.048640896 -2.267936856 17.857554362 -17.592514825 0.265039537 370.352317490 -378.343252891 -7.990935401
dipolemethod: SCF
magnitude: 8.310766037 au
magnitude: 21.124288490 debye
temp: 298.15 k
press: 1.00 atm
zeropoint: 0.32125987 hartree
thermalvibcorrection: 0.02286161 hartree
thermalrotcorrection: 0.00141627 hartree
thermaltrasncorrection: 0.00141627 hartree
thermaltotal: -1450.65865671 hartree
thermalcorr: 0.02569416 hartree
nonthermalcorr: 0.32125987 hartree
totalcorr: 0.34695403 hartree
thermalcorrenthalpy: 0.00094421 hartree
totalenthalpy: -1450.65771250 hartree
vibrat: 0.04205967 hartree
rotat: 0.01748233 hartree
transl: 0.02121783 hartree
total: 0.08075983 hartree
totalentropycorr: -0.08075983 hartree
gibbsenthalpy: -1450.73847233 hartree
gibbsminuselec: 0.26713841 hartree
