program: Orca
programVersion: 6.1.x
elementType: C H H C C H C H H C C H H Au P C C C H H H H H H H H H C C C C H C H C H H C F F F
elementType: Au
keywords: opt freq wb97x-d3bj def2-tzvp(-f) def2/J tightopt verytightscf
charge: 1
multiplicity: 1
frequency: 0.00 0.00 0.00 0.00 0.00 0.00 13.79 14.53 17.34 28.96 41.91 44.80 62.22 112.09 114.94 151.65 159.22 161.17 179.21 181.88 194.55 214.49 218.81 222.21 249.74 254.58 257.37 265.18 289.33 364.39 380.15 398.57 412.97 431.52 439.20 458.09 509.78 530.73 581.51 610.94 626.52 650.61 690.34 704.34 707.03 767.69 777.53 778.10 778.93 793.86 807.19 860.09 872.10 872.74 873.21 875.84 893.97 913.26 950.63 972.96 973.28 978.03 983.36 993.68 1005.40 1016.19 1030.17 1045.76 1074.00 1093.65 1104.11 1116.19 1122.66 1136.77 1159.80 1164.65 1212.04 1230.71 1249.66 1287.01 1312.79 1329.79 1335.91 1336.22 1348.83 1349.75 1351.62 1366.72 1381.87 1417.29 1444.33 1446.77 1447.27 1453.18 1454.30 1455.00 1460.62 1468.87 1487.53 1521.39 1584.04 1663.97 1705.17 3047.82 3073.45 3074.13 3074.38 3103.97 3135.37 3154.82 3163.97 3164.83 3165.45 3170.44 3170.59 3170.97 3181.78 3211.60 3222.05 3226.40 3241.57 3252.41 3278.71
frequency: 13.79 14.53 17.34 28.96 41.91 44.80 62.22 112.09 114.94 151.65 159.22 161.17 179.21 181.88 194.55 214.49 218.81 222.21 249.74 254.58 257.37 265.18 289.33 364.39 380.15 398.57 412.97 431.52 439.20 458.09 509.78 530.73 581.51 610.94 626.52 650.61 690.34 704.34 707.03 767.69 777.53 778.10 778.93 793.86 807.19 860.09 872.10 872.74 873.21 875.84 893.97 913.26 950.63 972.96 973.28 978.03 983.36 993.68 1005.40 1016.19 1030.17 1045.76 1074.00 1093.65 1104.11 1116.19 1122.66 1136.77 1159.80 1164.65 1212.04 1230.71 1249.66 1287.01 1312.79 1329.79 1335.91 1336.22 1348.83 1349.75 1351.62 1366.72 1381.87 1417.29 1444.33 1446.77 1447.27 1453.18 1454.30 1455.00 1460.62 1468.87 1487.53 1521.39 1584.04 1663.97 1705.17 3047.82 3073.45 3074.13 3074.38 3103.97 3135.37 3154.82 3163.97 3164.83 3165.45 3170.44 3170.59 3170.97 3181.78 3211.60 3222.05 3226.40 3241.57 3252.41 3278.71
formula: C16H20F3AuP
InChI: InChI=1/C13H11F3.C3H9P.Au/c14-13(15,16)10-5-3-9(4-6-10)12-7-1-2-11(12)8-12;1-4(2)3;/h3-6,11H,1,7-8H2;1-3H3;/rC16H20AuF3P/c1-21(2,3)17-14-8-9-15(10-13(14)15)11-4-6-12(7-5-11)16(18,19)20/h4-7,13H,8-10H2,1-3H3
41 atoms
C  -2.027704 -1.398894 -0.422021
H  -1.730515 -2.357372 -0.850863
H  -2.971524 -1.136858 -0.922804
C  -1.05261 -0.333516 -0.782047
C  -0.899985 0.557042 0.292565
H  -0.086705 1.264243 0.368753
C  -2.264552 1.055286 0.8996
H  -2.151505 2.047503 1.317478
H  -3.14759 0.890115 0.295632
C  -1.618177 -0.062022 1.559155
C  -2.125221 -1.424932 1.111424
H  -1.482209 -2.209849 1.512392
H  -3.141359 -1.59781 1.470928
Au -0.069372 -0.218999 -2.557762
P  1.045245 -0.080364 -4.586831
C  0.169014 0.922842 -5.812263
C  2.691813 0.659094 -4.456042
C  1.306727 -1.683582 -5.384287
H  0.341899 -2.159463 -5.569261
H  1.834683 -1.549163 -6.331207
H  1.8962 -2.324937 -4.726485
H  -0.815441 0.490337 -6.000119
H  0.737447 0.954316 -6.744695
H  0.041895 1.936781 -5.428534
H  2.605443 1.669857 -4.052973
H  3.164403 0.698021 -5.440242
H  3.306177 0.061075 -3.780459
C  -0.954733 0.087304 2.886809
C  0.196966 -0.650096 3.170877
C  -1.479934 0.932639 3.857091
C  0.814664 -0.537994 4.403164
H  0.614764 -1.307947 2.416479
C  -0.866195 1.049178 5.099604
H  -2.379228 1.501179 3.649961
C  0.277687 0.313982 5.366695
H  1.712564 -1.10716 4.617734
H  -1.284784 1.707945 5.850229
C  0.979038 0.428172 6.692381
F  2.20213 0.994203 6.566558
F  1.180387 -0.780819 7.262694
F  0.29795 1.171206 7.583489
totalener: -1398.92617536219973 hartree
nucrepener: 1904.73388475414504 hartree
electener: -3303.57595958708907 hartree
oneelecener: -5735.52642532562004 hartree
twoeener: 2431.95046573853097 hartree
cpcmener: -0.07788706969926 hartree
kineticenergy: 1303.90251507384824 hartree
exchangeener: -105.581415237144 hartree
dispersion: -0.107093230 hartree
dispersion: -0.108142100 hartree
dispersion: -0.107879059 hartree
dispersion: -0.108009971 hartree
dispersion: -0.108062499 hartree
dispersion: -0.108071427 hartree
dispersion: -0.108063086 hartree
dispersion: -0.108054370 hartree
dispersion: -0.108051090 hartree
dispersion: -0.108051060 hartree
dispersion: -0.108053691 hartree
dispersion: -0.108057205 hartree
dispersion: -0.108059748 hartree
dispersion: -0.108060640 hartree
dispersion: -0.108059803 hartree
dispersion: -0.108057077 hartree
dispersion: -0.108049697 hartree
dispersion: -0.108046684 hartree
dispersion: -0.108046722 hartree
dispersion: -0.108048599 hartree
dispersion: -0.108050360 hartree
dispersion: -0.108050774 hartree
dispersion: -0.108049973 hartree
dispersion: -0.108048421 hartree
elementType: C H Au P F
energy: -2098.5315 -675.0432 -674.9444 -674.9225 -286.7700 -281.9121 -281.2574 -280.9130 -280.7835 -280.6711 -280.6122 -280.3229 -280.3205 -280.2347 -280.1875 -280.1828 -280.0860 -279.8516 -279.8440 -279.8431 -182.3211 -132.0583 -132.0577 -132.0168 -116.9625 -67.7213 -67.2383 -67.1648 -39.6940 -37.2604 -37.1413 -29.3931 -28.0221 -25.9122 -25.3978 -25.2633 -24.7232 -24.0000 -23.0041 -23.0008 -22.9608 -21.6544 -21.0376 -20.7266 -19.6778 -19.5408 -19.3165 -19.0614 -18.9646 -18.7337 -17.9837 -16.6394 -16.4110 -16.3271 -16.2826 -16.0794 -15.8296 -15.5955 -15.3060 -15.2958 -15.2917 -15.2559 -15.0688 -14.9068 -14.7635 -14.6025 -14.4491 -14.4409 -14.2915 -14.2290 -13.9348 -13.9233 -13.6757 -13.3891 -12.9763 -12.8925 -12.8004 -12.6813 -12.2342 -12.0412 -11.7936 -11.7783 -11.6996 -11.4859 -10.4452 -10.2954 -10.1750 -9.8141 -1.0305 0.8770 1.1149 1.2362 1.5508 2.1775 2.8415 3.2712 3.5011 3.6419 3.7640 electronvolt
chargesum: 1.0000000
charge: -0.240645 0.169198 0.183703 -0.084978 -0.095510 0.154016 -0.178223 0.169641 0.150753 0.206760 -0.257397 0.140820 0.137740 0.096678 0.653550 -0.586733 -0.590994 -0.592122 0.177144 0.167972 0.177330 0.177389 0.168115 0.177412 0.177082 0.168132 0.177432 0.361113 -0.288586 -0.299835 -0.273828 0.141271 -0.250656 0.140438 0.352631 0.139730 0.139100 0.460602 -0.210378 -0.210675 -0.205190
charge: -0.203049 0.155660 0.172311 -0.171020 -0.125367 0.158280 -0.054898 0.151692 0.146828 -0.132729 -0.146641 0.141815 0.140773 0.286961 0.636358 -0.434551 -0.434740 -0.434895 0.125824 0.121007 0.125816 0.125872 0.121207 0.125918 0.125847 0.121031 0.125866 -0.084659 -0.075586 -0.077167 -0.077655 0.152630 -0.077596 0.152420 -0.122139 0.154628 0.152391 -0.331459 0.081629 0.085188 0.096199
qa: -0.2406 0.1692 0.1837 -0.0850 -0.0955 0.1540 -0.1782 0.1696 0.1508 0.2068 -0.2574 0.1408 0.1377 0.0967 0.6535 -0.5867 -0.5910 -0.5921 0.1771 0.1680 0.1773 0.1774 0.1681 0.1774 0.1771 0.1681 0.1774 0.3611 -0.2886 -0.2998 -0.2738 0.1413 -0.2507 0.1404 0.3526 0.1397 0.1391 0.4606 -0.2104 -0.2107 -0.2052
va: 3.9383 0.9525 0.9565 3.4892 3.8571 0.9462 3.9900 0.9609 0.9557 3.7535 4.0299 0.9656 0.9682 1.7017 4.0311 3.8448 3.8426 3.8415 0.9548 0.9575 0.9546 0.9545 0.9574 0.9546 0.9549 0.9575 0.9544 3.6179 3.9587 3.9198 3.9306 0.9649 3.8526 0.9665 3.6592 0.9801 0.9799 4.4214 1.0805 1.0844 1.0966
dispersion: -0.108048239 hartree
energy: -1399.035256154068 hartree
dipole: 4.221869425 -5.433686329 -1.211816904 23.059524482 -23.196251710 -0.136727228 329.020615715 -334.051363995 -5.030748281
dipolemethod: SCF
magnitude: 5.176448860 au
magnitude: 13.157487361 debye
temp: 298.15 k
press: 1.00 atm
zeropoint: 0.32605085 hartree
thermalvibcorrection: 0.02025631 hartree
thermalrotcorrection: 0.00141627 hartree
thermaltrasncorrection: 0.00141627 hartree
thermaltotal: -1398.68611645 hartree
thermalcorr: 0.02308885 hartree
nonthermalcorr: 0.32605085 hartree
totalcorr: 0.34913971 hartree
thermalcorrenthalpy: 0.00094421 hartree
totalenthalpy: -1398.68517224 hartree
vibrat: 0.03734346 hartree
rotat: 0.01725743 hartree
transl: 0.02114289 hartree
total: 0.07574378 hartree
totalentropycorr: -0.07574378 hartree
gibbsenthalpy: -1398.76091602 hartree
gibbsminuselec: 0.27434013 hartree
