program: Orca
programVersion: 6.1.x
elementType: C H H C C H C H H C C H H Au P C C C H H H H H H H H H C C C C H C H C H H C N
elementType: Au
keywords: opt freq wb97x-d3bj def2-tzvp(-f) def2/J tightopt verytightscf
charge: 1
multiplicity: 1
frequency: 0.00 0.00 0.00 0.00 0.00 0.00 15.96 22.43 29.84 43.53 46.84 65.82 113.76 118.34 153.15 162.49 165.47 175.69 184.59 198.82 219.34 222.17 224.17 244.51 255.81 259.34 301.97 319.51 365.08 392.52 415.19 449.24 476.68 506.85 558.98 583.66 587.19 631.94 663.23 697.96 705.58 761.21 771.46 778.36 778.99 796.20 808.58 860.70 872.71 873.69 874.06 876.01 895.73 913.51 951.78 973.95 974.18 977.86 983.78 993.71 1009.28 1017.24 1031.32 1050.64 1074.74 1105.37 1120.17 1145.11 1163.12 1205.76 1231.24 1236.22 1250.20 1282.33 1307.11 1329.42 1336.82 1337.28 1346.67 1349.94 1366.32 1380.36 1416.34 1444.57 1447.32 1447.69 1450.53 1454.68 1455.06 1461.31 1466.50 1487.02 1522.46 1574.64 1647.82 1697.10 2383.60 3045.62 3073.79 3074.41 3074.67 3104.48 3136.17 3155.66 3164.58 3164.76 3165.36 3170.50 3171.03 3171.32 3182.15 3215.95 3223.09 3235.69 3238.23 3252.62 3279.33
frequency: 15.96 22.43 29.84 43.53 46.84 65.82 113.76 118.34 153.15 162.49 165.47 175.69 184.59 198.82 219.34 222.17 224.17 244.51 255.81 259.34 301.97 319.51 365.08 392.52 415.19 449.24 476.68 506.85 558.98 583.66 587.19 631.94 663.23 697.96 705.58 761.21 771.46 778.36 778.99 796.20 808.58 860.70 872.71 873.69 874.06 876.01 895.73 913.51 951.78 973.95 974.18 977.86 983.78 993.71 1009.28 1017.24 1031.32 1050.64 1074.74 1105.37 1120.17 1145.11 1163.12 1205.76 1231.24 1236.22 1250.20 1282.33 1307.11 1329.42 1336.82 1337.28 1346.67 1349.94 1366.32 1380.36 1416.34 1444.57 1447.32 1447.69 1450.53 1454.68 1455.06 1461.31 1466.50 1487.02 1522.46 1574.64 1647.82 1697.10 2383.60 3045.62 3073.79 3074.41 3074.67 3104.48 3136.17 3155.66 3164.58 3164.76 3165.36 3170.50 3171.03 3171.32 3182.15 3215.95 3223.09 3235.69 3238.23 3252.62 3279.33
formula: C16H20AuNP
InChI: InChI=1/C13H11N.C3H9P.Au/c14-9-10-3-5-11(6-4-10)13-7-1-2-12(13)8-13;1-4(2)3;/h3-6,12H,1,7-8H2;1-3H3;/rC16H20AuNP/c1-19(2,3)17-15-8-9-16(10-14(15)16)13-6-4-12(11-18)5-7-13/h4-7,14H,8-10H2,1-3H3
39 atoms
C  -1.682486 -1.648346 0.402462
H  -1.274474 -2.570905 -0.013576
H  -2.690187 -1.555417 -0.029333
C  -0.913307 -0.466284 -0.073342
C  -0.826524 0.490869 0.950571
H  -0.129423 1.316231 0.935307
C  -2.200272 0.802905 1.651894
H  -2.212562 1.819621 2.023203
H  -3.090935 0.474637 1.131591
C  -1.338841 -0.170165 2.293906
C  -1.660049 -1.614783 1.938928
H  -0.875026 -2.273041 2.313961
H  -2.60715 -1.922321 2.386117
Au -0.075416 -0.292707 -1.917344
P  0.884788 -0.083267 -4.018255
C  0.354472 1.402605 -4.905177
C  2.691372 0.013095 -3.966902
C  0.513604 -1.460062 -5.132192
H  -0.566521 -1.533509 -5.271874
H  0.996295 -1.300863 -6.099212
H  0.876594 -2.390958 -4.692558
H  -0.728416 1.378895 -5.040331
H  0.842581 1.449557 -5.881387
H  0.618441 2.287183 -4.322679
H  2.992937 0.874746 -3.368458
H  3.089289 0.114872 -4.979235
H  3.091239 -0.892881 -3.507764
C  -0.600435 0.143034 3.551753
C  0.663779 -0.409759 3.762799
C  -1.163835 0.962564 4.526273
C  1.361564 -0.144937 4.927227
H  1.107462 -1.044068 3.003313
C  -0.476378 1.235035 5.699659
H  -2.149532 1.386263 4.373395
C  0.786366 0.680716 5.895407
H  2.345914 -0.567087 5.090874
H  -0.913508 1.870541 6.460475
C  1.50785 0.963501 7.109479
N  2.085221 1.189363 8.078205
totalener: -1154.00872268294916 hartree
nucrepener: 1560.23351931252068 hartree
electener: -2714.14933284709423 hartree
oneelecener: -4704.06400120912167 hartree
twoeener: 1989.91466836202767 hartree
cpcmener: -0.08699863139693 hartree
kineticenergy: 1059.60094229897982 hartree
exchangeener: -88.635554638961 hartree
dispersion: -0.105273778 hartree
dispersion: -0.106379052 hartree
dispersion: -0.106118876 hartree
dispersion: -0.106238655 hartree
dispersion: -0.106294427 hartree
dispersion: -0.106301044 hartree
dispersion: -0.106291524 hartree
dispersion: -0.106283164 hartree
dispersion: -0.106280718 hartree
dispersion: -0.106280776 hartree
elementType: C H Au P N
energy: -2098.5394 -392.5736 -281.9399 -281.3061 -281.1701 -281.1416 -280.9382 -280.8155 -280.7531 -280.4933 -280.4911 -280.2768 -280.2733 -280.2579 -280.1194 -279.8556 -279.8540 -279.8466 -182.3290 -132.0659 -132.0656 -132.0250 -116.9757 -67.7348 -67.2517 -67.1776 -29.4360 -29.0160 -28.0086 -25.8514 -25.4025 -25.2104 -24.8398 -23.8847 -23.0099 -23.0068 -21.9398 -21.3787 -20.6991 -19.2889 -18.9853 -18.8943 -18.7419 -17.8851 -16.7329 -16.4717 -16.1199 -15.7466 -15.4702 -15.3006 -15.2976 -15.2543 -14.9610 -14.7052 -14.6679 -14.4476 -14.4390 -14.2011 -14.0672 -13.9404 -13.7277 -13.6004 -13.3115 -13.2161 -12.9133 -12.8130 -12.6686 -12.5263 -12.2544 -12.0668 -11.8179 -11.7895 -11.6976 -11.4700 -10.4261 -10.2990 -10.2914 -9.7566 -1.0875 0.3585 1.1013 1.1517 1.5227 2.1652 2.8151 3.0120 3.1679 3.3010 3.5497 electronvolt
chargesum: 1.0000000
charge: -0.241928 0.169232 0.184486 -0.086253 -0.090448 0.154806 -0.182002 0.170885 0.151393 0.185698 -0.257495 0.141161 0.138607 0.097670 0.653566 -0.588305 -0.588177 -0.592861 0.177191 0.167835 0.177184 0.177359 0.168056 0.177238 0.177457 0.168400 0.177559 0.358882 -0.265224 -0.279044 -0.264155 0.144199 -0.251991 0.143691 0.559792 0.143911 0.145168 -0.212429 -0.211114
charge: -0.202416 0.155712 0.172691 -0.170238 -0.124993 0.158620 -0.055006 0.151936 0.147124 -0.131821 -0.145924 0.141986 0.141033 0.287710 0.636541 -0.434569 -0.434549 -0.434867 0.125864 0.121016 0.125843 0.125881 0.121136 0.125899 0.125929 0.121219 0.125889 -0.077855 -0.072430 -0.073930 -0.059565 0.154221 -0.057831 0.154075 -0.145412 0.156670 0.157010 -0.074338 -0.038260
qa: -0.2419 0.1692 0.1845 -0.0863 -0.0904 0.1548 -0.1820 0.1709 0.1514 0.1857 -0.2575 0.1412 0.1386 0.0977 0.6536 -0.5883 -0.5882 -0.5929 0.1772 0.1678 0.1772 0.1774 0.1681 0.1772 0.1775 0.1684 0.1776 0.3589 -0.2652 -0.2790 -0.2642 0.1442 -0.2520 0.1437 0.5598 0.1439 0.1452 -0.2124 -0.2111
va: 3.9403 0.9528 0.9564 3.4912 3.8547 0.9462 3.9957 0.9605 0.9556 3.7575 4.0315 0.9657 0.9680 1.7023 4.0309 3.8435 3.8448 3.8409 0.9548 0.9576 0.9548 0.9546 0.9576 0.9548 0.9546 0.9574 0.9543 3.6580 3.9359 3.9324 3.9060 0.9637 3.9092 0.9648 3.5680 0.9729 0.9719 3.9294 3.1427
dispersion: -0.106282030 hartree
energy: -1154.115835065393 hartree
dipole: 10.687847508 -12.374278078 -1.686430570 30.254666147 -30.852325343 -0.597659197 259.116848838 -263.614829216 -4.497980378
dipolemethod: SCF
magnitude: 4.840771846 au
magnitude: 12.304264197 debye
temp: 298.15 k
press: 1.00 atm
zeropoint: 0.32037145 hartree
thermalvibcorrection: 0.01836533 hartree
thermalrotcorrection: 0.00141627 hartree
thermaltrasncorrection: 0.00141627 hartree
thermaltotal: -1153.77426574 hartree
thermalcorr: 0.02119787 hartree
nonthermalcorr: 0.32037145 hartree
totalcorr: 0.34156932 hartree
thermalcorrenthalpy: 0.00094421 hartree
totalenthalpy: -1153.77332153 hartree
vibrat: 0.03334745 hartree
rotat: 0.01684371 hartree
transl: 0.02101484 hartree
total: 0.07120601 hartree
totalentropycorr: -0.07120601 hartree
gibbsenthalpy: -1153.84452754 hartree
gibbsminuselec: 0.27130752 hartree
