program: Orca
programVersion: 6.1.x
elementType: C H H C C H C H H C C H H Au P C C C H H H H H H H H H C C C C H C H C H O C H H H O C H H H
elementType: Au
keywords: opt freq wb97x-d3bj def2-svp def2/J tightopt verytightscf
charge: 1
multiplicity: 1
frequency: 0.00 0.00 0.00 0.00 0.00 0.00 9.50 13.79 21.13 34.35 36.89 73.72 93.50 98.75 128.49 140.29 144.66 168.01 174.08 183.13 186.70 193.45 204.71 210.95 220.02 221.66 226.48 236.94 261.62 262.95 277.29 301.76 344.59 353.98 364.96 402.05 427.14 454.54 477.26 486.51 511.08 546.75 592.19 634.15 659.66 707.19 710.54 745.85 769.29 774.13 774.50 797.99 813.99 817.87 843.95 862.48 863.37 877.02 905.99 932.06 943.48 960.71 961.38 963.47 971.28 994.78 1008.78 1018.37 1057.75 1068.29 1073.25 1091.60 1137.90 1174.38 1179.40 1185.34 1195.65 1207.19 1216.35 1218.30 1266.16 1279.22 1295.13 1309.29 1310.16 1310.32 1324.23 1325.47 1355.63 1360.27 1381.85 1414.48 1417.59 1419.22 1419.48 1427.48 1427.75 1432.05 1432.62 1440.09 1458.22 1464.39 1465.12 1467.18 1472.61 1478.59 1483.43 1513.27 1538.52 1625.17 1632.93 1681.62 1693.11 3033.47 3054.29 3074.19 3074.90 3074.96 3075.56 3080.94 3103.02 3135.66 3147.28 3167.21 3175.17 3186.56 3186.68 3186.87 3189.03 3192.96 3193.10 3193.45 3202.96 3204.99 3225.03 3264.71 3280.86 3292.51
frequency: 9.50 13.79 21.13 34.35 36.89 73.72 93.50 98.75 128.49 140.29 144.66 168.01 174.08 183.13 186.70 193.45 204.71 210.95 220.02 221.66 226.48 236.94 261.62 262.95 277.29 301.76 344.59 353.98 364.96 402.05 427.14 454.54 477.26 486.51 511.08 546.75 592.19 634.15 659.66 707.19 710.54 745.85 769.29 774.13 774.50 797.99 813.99 817.87 843.95 862.48 863.37 877.02 905.99 932.06 943.48 960.71 961.38 963.47 971.28 994.78 1008.78 1018.37 1057.75 1068.29 1073.25 1091.60 1137.90 1174.38 1179.40 1185.34 1195.65 1207.19 1216.35 1218.30 1266.16 1279.22 1295.13 1309.29 1310.16 1310.32 1324.23 1325.47 1355.63 1360.27 1381.85 1414.48 1417.59 1419.22 1419.48 1427.48 1427.75 1432.05 1432.62 1440.09 1458.22 1464.39 1465.12 1467.18 1472.61 1478.59 1483.43 1513.27 1538.52 1625.17 1632.93 1681.62 1693.11 3033.47 3054.29 3074.19 3074.90 3074.96 3075.56 3080.94 3103.02 3135.66 3147.28 3167.21 3175.17 3186.56 3186.68 3186.87 3189.03 3192.96 3193.10 3193.45 3202.96 3204.99 3225.03 3264.71 3280.86 3292.51
formula: C17H25AuO2P
InChI: InChI=1/C14H16O2.C3H9P.Au/c1-15-13-9-8-12(10-14(13)16-2)11-6-4-3-5-7-11;1-4(2)3;/h4,8-10H,5-7H2,1-2H3;1-3H3;/rC17H25AuO2P/c1-19-16-11-8-14(12-17(16)20-2)13-6-9-15(10-7-13)18-21(3,4)5/h8-9,11-12H,6-7,10H2,1-5H3
46 atoms
C  -0.116104 -1.3418 -0.013206
H  0.891666 -1.021565 0.303238
H  0.030435 -2.241343 -0.630279
C  -0.7710 -0.24442 -0.819614
C  -1.75254 0.469532 -0.263006
H  -2.255091 1.266548 -0.80582
C  -2.260218 0.308668 1.172989
H  -2.42789 1.290765 1.608682
H  -3.228681 -0.211451 1.155377
C  -1.328868 -0.533915 1.960436
C  -0.949027 -1.762541 1.226445
H  -0.407033 -2.49719 1.830047
H  -1.878281 -2.226365 0.859111
Au -0.108536 0.106447 -2.739764
P  0.627184 0.494202 -4.901123
C  -0.591866 0.068312 -6.184944
C  1.058985 2.22966 -5.243154
C  2.117546 -0.445539 -5.360267
H  1.914512 -1.52325 -5.267523
H  2.413638 -0.217908 -6.396316
H  2.941458 -0.183232 -4.679401
H  -0.84974 -0.998712 -6.106056
H  -0.184712 0.272285 -7.187729
H  -1.505823 0.662726 -6.034434
H  0.178486 2.867185 -5.071181
H  1.395824 2.346124 -6.285226
H  1.862443 2.54886 -4.56206
C  -0.80423 -0.173476 3.206227
C  0.172313 -0.997947 3.867894
C  -1.224379 1.019881 3.861673
C  0.693495 -0.647247 5.087456
H  0.513328 -1.911975 3.388282
C  -0.718435 1.377087 5.093976
H  -1.968338 1.669911 3.402642
C  0.241755 0.562251 5.725132
H  -1.062817 2.29164 5.576636
O  0.783241 0.819113 6.893828
C  0.40801 1.995302 7.61803
H  -0.665639 1.974262 7.859528
H  0.996599 1.976572 8.543109
H  0.65222 2.899625 7.039895
O  1.614177 -1.338617 5.780568
C  2.108392 -2.542861 5.217503
H  2.84063 -2.941018 5.931876
H  1.29965 -3.280406 5.077118
H  2.60748 -2.357157 4.250891
totalener: -1290.07114919506375 hartree
nucrepener: 1893.74661124826434 hartree
electener: -3183.73938515196960 hartree
oneelecener: -5556.58012170450547 hartree
twoeener: 2372.84073655253587 hartree
cpcmener: -0.07247845761834 hartree
kineticenergy: 1190.55654023154193 hartree
exchangeener: -99.876485384506 hartree
dispersion: -0.116184659 hartree
dispersion: -0.115723017 hartree
dispersion: -0.115660806 hartree
dispersion: -0.115631741 hartree
dispersion: -0.115615361 hartree
dispersion: -0.115629286 hartree
dispersion: -0.115624561 hartree
dispersion: -0.115618983 hartree
dispersion: -0.115613525 hartree
dispersion: -0.115604890 hartree
dispersion: -0.115602867 hartree
dispersion: -0.115603422 hartree
dispersion: -0.115605185 hartree
dispersion: -0.115606939 hartree
dispersion: -0.115608428 hartree
dispersion: -0.115609178 hartree
dispersion: -0.115610408 hartree
dispersion: -0.115611367 hartree
elementType: C H Au P O
energy: -2098.1951 -525.2279 -524.4464 -283.3245 -282.4714 -282.2083 -281.8253 -281.5680 -281.4548 -281.1658 -281.0388 -280.8693 -280.5407 -280.3108 -280.1885 -280.1845 -280.1810 -280.1459 -279.4900 -279.3279 -182.3230 -132.1904 -132.1901 -132.1362 -116.1993 -66.9250 -66.4599 -66.4562 -33.9922 -32.9552 -28.2798 -27.2296 -25.4561 -25.0239 -25.0075 -24.3537 -24.0880 -23.1360 -22.8495 -22.5662 -22.5610 -21.1444 -20.7643 -20.1819 -19.3122 -18.7330 -18.5153 -18.0025 -17.8031 -17.1176 -17.0474 -16.8076 -16.1852 -16.0987 -15.8262 -15.6705 -15.4688 -15.1886 -15.0681 -15.0613 -14.9778 -14.7390 -14.4894 -14.3611 -14.2193 -14.1995 -14.1597 -13.9443 -13.7184 -13.6092 -13.4683 -12.9521 -12.7745 -12.6347 -12.5596 -12.5329 -12.4814 -12.4496 -11.9963 -11.5982 -11.1350 -11.0938 -11.0823 -10.4016 -9.8821 -9.4250 -9.1828 -8.8704 -1.7055 1.1886 1.3938 1.5028 2.3596 2.6122 2.9890 3.4694 3.8502 4.0534 4.2517 electronvolt
chargesum: 1.0000000
charge: 0.131301 0.038311 0.046187 -0.379402 -0.147101 0.112376 -0.296140 0.111302 0.128020 0.048192 0.160868 0.046969 0.060237 0.013436 0.072633 -0.137733 -0.137954 -0.134557 0.086426 0.073934 0.086154 0.086130 0.074112 0.087022 0.087275 0.074342 0.086199 0.061961 -0.119178 0.049916 0.205956 0.041134 -0.129772 0.055319 0.251574 0.049367 -0.284961 0.141268 0.071948 0.076217 0.071919 -0.338086 0.147935 0.063528 0.052569 0.052847
charge: 0.250212 0.064509 0.065126 -0.665816 -0.322684 0.200963 -0.358205 0.199033 0.223450 -0.427210 0.238394 0.058094 0.092729 -0.066065 0.750921 -0.178341 -0.178600 -0.178371 0.048547 0.039851 0.048465 0.048556 0.039726 0.048555 0.048510 0.039808 0.048476 0.186924 0.014713 0.113258 0.028117 0.057253 -0.072988 0.067268 0.122434 0.056786 -0.043278 0.102997 0.035707 0.042001 0.035701 -0.102272 0.089326 0.036383 0.025502 0.025536
qa: 0.1313 0.0383 0.0462 -0.3794 -0.1471 0.1124 -0.2961 0.1113 0.1280 0.0482 0.1609 0.0470 0.0602 0.0134 0.0726 -0.1377 -0.1380 -0.1346 0.0864 0.0739 0.0862 0.0861 0.0741 0.0870 0.0873 0.0743 0.0862 0.0620 -0.1192 0.0499 0.2060 0.0411 -0.1298 0.0553 0.2516 0.0494 -0.2850 0.1413 0.0719 0.0762 0.0719 -0.3381 0.1479 0.0635 0.0526 0.0528
va: 4.0167 0.9703 0.9662 3.8863 4.0484 0.9407 3.8788 0.9335 0.9365 4.1600 3.9813 0.9852 0.9814 1.5157 4.1035 3.8985 3.8987 3.9006 0.9872 0.9926 0.9873 0.9874 0.9920 0.9876 0.9875 0.9921 0.9873 3.7095 3.8229 3.8115 3.8967 1.0168 3.8526 0.9925 3.8830 1.0025 2.2886 3.8561 0.9874 0.9911 0.9874 2.1865 3.8933 0.9908 0.9870 0.9872
dispersion: -0.115612308 hartree
energy: -1290.189095688981 hartree
dipole: 18.543437567 -18.668576079 -0.125138512 -10.652454569 10.994607570 0.342153001 374.721893523 -371.588437634 3.133455889
dipolemethod: SCF
magnitude: 3.154564016 au
magnitude: 8.018264507 debye
temp: 298.15 k
press: 1.00 atm
zeropoint: 0.38847888 hartree
thermalvibcorrection: 0.02186991 hartree
thermalrotcorrection: 0.00141627 hartree
thermaltrasncorrection: 0.00141627 hartree
thermaltotal: -1289.77591437 hartree
thermalcorr: 0.02470245 hartree
nonthermalcorr: 0.38847888 hartree
totalcorr: 0.41318132 hartree
thermalcorrenthalpy: 0.00094421 hartree
totalenthalpy: -1289.77497016 hartree
vibrat: 0.04031477 hartree
rotat: 0.01723918 hartree
transl: 0.02112008 hartree
total: 0.07867403 hartree
totalentropycorr: -0.07867403 hartree
gibbsenthalpy: -1289.85364419 hartree
gibbsminuselec: 0.33545150 hartree
