program: Orca
programVersion: 6.1.x
elementType: C H H C C H C H H C C H H Au P C C C H H H H H H H H H C C C C H C H C H H C H H H
elementType: Au
keywords: opt freq wb97x-d3bj def2-svp def2/J tightopt verytightscf
charge: 1
multiplicity: 1
frequency: 0.00 0.00 0.00 0.00 0.00 0.00 13.97 19.92 20.54 34.69 36.88 50.46 92.58 107.45 130.14 142.47 182.14 182.50 193.68 210.45 218.26 220.92 221.38 231.42 260.66 264.18 280.08 363.75 366.77 376.10 406.81 429.52 455.41 479.61 501.80 531.56 646.27 662.71 707.72 711.32 737.78 761.55 774.75 775.64 797.46 826.95 838.42 853.38 862.62 862.94 863.82 900.49 928.81 959.52 960.58 961.00 970.91 978.98 996.39 1006.36 1032.03 1033.04 1043.69 1059.21 1060.11 1068.16 1128.99 1157.43 1167.08 1181.32 1206.24 1253.10 1264.20 1272.08 1302.67 1309.94 1310.60 1324.34 1329.64 1350.87 1355.12 1384.00 1402.36 1417.31 1419.20 1419.37 1427.36 1427.44 1429.21 1432.62 1438.48 1439.54 1448.21 1477.89 1496.00 1510.11 1575.35 1633.24 1682.21 1692.20 3057.35 3073.91 3074.62 3075.28 3075.71 3082.75 3119.67 3143.23 3160.70 3176.64 3184.76 3187.04 3187.25 3187.84 3193.43 3193.69 3194.04 3194.63 3213.66 3228.07 3232.37 3269.21 3273.96
frequency: 13.97 19.92 20.54 34.69 36.88 50.46 92.58 107.45 130.14 142.47 182.14 182.50 193.68 210.45 218.26 220.92 221.38 231.42 260.66 264.18 280.08 363.75 366.77 376.10 406.81 429.52 455.41 479.61 501.80 531.56 646.27 662.71 707.72 711.32 737.78 761.55 774.75 775.64 797.46 826.95 838.42 853.38 862.62 862.94 863.82 900.49 928.81 959.52 960.58 961.00 970.91 978.98 996.39 1006.36 1032.03 1033.04 1043.69 1059.21 1060.11 1068.16 1128.99 1157.43 1167.08 1181.32 1206.24 1253.10 1264.20 1272.08 1302.67 1309.94 1310.60 1324.34 1329.64 1350.87 1355.12 1384.00 1402.36 1417.31 1419.20 1419.37 1427.36 1427.44 1429.21 1432.62 1438.48 1439.54 1448.21 1477.89 1496.00 1510.11 1575.35 1633.24 1682.21 1692.20 3057.35 3073.91 3074.62 3075.28 3075.71 3082.75 3119.67 3143.23 3160.70 3176.64 3184.76 3187.04 3187.25 3187.84 3193.43 3193.69 3194.04 3194.63 3213.66 3228.07 3232.37 3269.21 3273.96
formula: C16H23AuP
InChI: InChI=1/C13H14.C3H9P.Au/c1-11-7-9-13(10-8-11)12-5-3-2-4-6-12;1-4(2)3;/h3,7-10H,4-6H2,1H3;1-3H3;/rC16H23AuP/c1-13-5-7-14(8-6-13)15-9-11-16(12-10-15)17-18(2,3)4/h5-8,11H,9-10,12H2,1-4H3
41 atoms
C  -0.752367 -1.382296 0.769023
H  0.297152 -1.604233 1.025686
H  -1.099885 -2.21424 0.137964
C  -0.828573 -0.072753 0.026678
C  -1.340857 0.998895 0.633001
H  -1.398585 1.968332 0.145188
C  -1.874714 1.028232 2.08145
H  -1.615964 1.977812 2.542166
H  -2.967847 0.93999 2.05854
C  -1.32721 -0.145945 2.782041
C  -1.619613 -1.39974 2.068367
H  -1.427249 -2.307473 2.648369
H  -2.674577 -1.381098 1.75845
Au -0.107991 0.005587 -1.904409
P  0.696157 0.092182 -4.073248
C  -0.536425 0.630111 -5.300373
C  2.095224 1.234393 -4.302517
C  1.301025 -1.505414 -4.702213
H  0.483997 -2.242333 -4.677043
H  1.666086 -1.40005 -5.735917
H  2.119921 -1.865457 -4.06107
H  -1.389757 -0.064964 -5.292571
H  -0.092897 0.652565 -6.308182
H  -0.89961 1.635612 -5.039091
H  1.785096 2.2535 -4.025855
H  2.431334 1.22733 -5.351255
H  2.928075 0.930788 -3.650304
C  -0.485786 -0.067493 3.91829
C  0.163644 -1.229471 4.42895
C  -0.249723 1.170559 4.578317
C  1.006013 -1.146083 5.518428
H  0.011642 -2.198801 3.954096
C  0.585618 1.239173 5.678482
H  -0.738293 2.081102 4.231711
C  1.230801 0.087454 6.165329
H  1.50411 -2.045111 5.891395
H  0.748057 2.197671 6.177891
C  2.144549 0.154507 7.351674
H  2.192926 1.168035 7.772719
H  1.804556 -0.542999 8.134086
H  3.160922 -0.159063 7.061971
totalener: -1100.44539792252954 hartree
nucrepener: 1493.93398081646569 hartree
electener: -2594.30189102883787 hartree
oneelecener: -4501.42704665482415 hartree
twoeener: 1907.12515562598628 hartree
cpcmener: -0.06920892048817 hartree
kineticenergy: 1002.58341885596167 hartree
exchangeener: -84.446688347098 hartree
dispersion: -0.107745666 hartree
dispersion: -0.107355244 hartree
dispersion: -0.107305738 hartree
dispersion: -0.107289286 hartree
dispersion: -0.107265172 hartree
dispersion: -0.107278147 hartree
elementType: C H Au P
energy: -2098.2315 -282.5922 -281.6051 -281.3414 -281.3049 -281.2492 -280.7467 -280.7441 -280.6814 -280.5010 -280.2874 -280.2779 -280.2081 -280.2046 -280.2023 -279.6894 -279.4602 -182.3584 -132.2258 -132.2251 -132.1725 -116.2548 -66.9834 -66.5158 -66.5121 -28.4502 -27.4819 -25.6850 -25.0441 -24.8876 -24.3765 -24.2349 -22.7431 -22.5875 -22.5821 -21.1584 -20.7021 -20.3166 -19.3210 -18.5534 -18.3600 -17.1654 -16.8444 -16.3644 -16.0163 -15.5740 -15.4981 -15.4054 -15.2856 -15.0873 -15.0830 -15.0774 -14.6908 -14.4900 -14.2214 -14.2185 -13.9293 -13.8443 -13.7618 -13.7384 -13.4303 -13.2614 -12.9971 -12.8056 -12.5961 -12.5671 -12.0817 -11.6583 -11.2032 -11.1503 -11.1400 -10.5980 -10.5252 -9.9161 -9.3169 -9.1290 -1.8882 1.1526 1.1629 1.3972 2.0993 2.5340 2.8947 3.4508 3.9150 4.2128 4.2677 electronvolt
chargesum: 1.0000000
charge: 0.126703 0.044543 0.053729 -0.355714 -0.153879 0.118790 -0.284147 0.114834 0.125612 0.053937 0.167145 0.058893 0.064632 0.021984 0.073152 -0.137546 -0.137680 -0.134073 0.086821 0.074539 0.086676 0.086590 0.074835 0.087555 0.087425 0.074916 0.086467 0.044071 0.028322 0.037422 -0.024538 0.054779 -0.030462 0.053040 -0.066313 0.039443 0.040521 0.066162 0.049762 0.069480 0.071572
charge: 0.261483 0.067695 0.068691 -0.659484 -0.310109 0.203696 -0.351153 0.199979 0.222750 -0.393856 0.243656 0.063143 0.094515 -0.059540 0.752107 -0.177945 -0.178150 -0.177908 0.048828 0.040192 0.048741 0.048834 0.040137 0.048753 0.048727 0.040138 0.048671 0.181768 0.090382 0.102113 -0.024685 0.059316 -0.029911 0.064811 0.063244 0.049376 0.049114 -0.039213 0.040696 0.054491 0.055907
qa: 0.1267 0.0445 0.0537 -0.3557 -0.1539 0.1188 -0.2841 0.1148 0.1256 0.0539 0.1671 0.0589 0.0646 0.0220 0.0732 -0.1375 -0.1377 -0.1341 0.0868 0.0745 0.0867 0.0866 0.0748 0.0876 0.0874 0.0749 0.0865 0.0441 0.0283 0.0374 -0.0245 0.0548 -0.0305 0.0530 -0.0663 0.0394 0.0405 0.0662 0.0498 0.0695 0.0716
va: 4.0229 0.9711 0.9670 3.8755 4.0735 0.9441 3.8499 0.9330 0.9433 4.1344 3.9750 0.9823 0.9822 1.5151 4.1094 3.8985 3.8987 3.9006 0.9873 0.9925 0.9872 0.9875 0.9920 0.9876 0.9875 0.9920 0.9874 3.7335 3.8289 3.8266 3.8615 0.9906 3.8736 0.9910 3.8863 0.9945 0.9940 3.8974 0.9983 0.9927 0.9926
dispersion: -0.107282095 hartree
energy: -1100.554523597355 hartree
dipole: 22.369202104 -22.026772260 0.342429844 -2.412544063 2.116527812 -0.296016250 265.758879744 -262.429013247 3.329866497
dipolemethod: SCF
magnitude: 3.360490248 au
magnitude: 8.541687391 debye
temp: 298.15 k
press: 1.00 atm
zeropoint: 0.34973119 hartree
thermalvibcorrection: 0.01858228 hartree
thermalrotcorrection: 0.00141627 hartree
thermaltrasncorrection: 0.00141627 hartree
thermaltotal: -1100.18337759 hartree
thermalcorr: 0.02141482 hartree
nonthermalcorr: 0.34973119 hartree
totalcorr: 0.37114601 hartree
thermalcorrenthalpy: 0.00094421 hartree
totalenthalpy: -1100.18243338 hartree
vibrat: 0.03418672 hartree
rotat: 0.01671898 hartree
transl: 0.02098018 hartree
total: 0.07188588 hartree
totalentropycorr: -0.07188588 hartree
gibbsenthalpy: -1100.25431926 hartree
gibbsminuselec: 0.30020434 hartree
