program: Orca
programVersion: 6.1.x
elementType: C H H C C H C H H C C H H Au P C C C H H H H H H H H H C C C C H C H C H H C F F F
elementType: Au
keywords: opt freq wb97x-d3bj def2-svp def2/J tightopt verytightscf
charge: 1
multiplicity: 1
frequency: 0.00 0.00 0.00 0.00 0.00 0.00 6.42 14.46 15.51 18.27 37.22 38.87 74.95 119.13 126.65 133.43 142.67 150.27 183.14 185.20 194.06 208.03 219.63 222.18 237.66 259.86 261.93 269.74 318.63 327.30 366.95 386.66 402.45 421.96 430.83 436.62 489.16 516.91 554.27 595.86 626.63 667.20 694.68 707.64 717.78 742.18 758.52 775.49 775.98 797.23 832.42 844.43 851.28 862.83 864.24 871.29 908.94 941.97 960.79 961.33 969.21 972.27 987.21 1005.26 1013.84 1026.23 1045.87 1058.98 1077.45 1117.87 1133.35 1147.01 1153.89 1168.51 1195.42 1199.78 1219.83 1235.64 1248.35 1278.65 1309.97 1310.30 1324.16 1324.94 1338.17 1362.54 1371.40 1393.69 1417.31 1418.68 1419.37 1427.15 1427.50 1427.82 1432.41 1436.05 1489.23 1509.16 1531.80 1557.12 1666.39 1676.17 1710.27 3074.95 3075.64 3075.79 3087.76 3107.67 3129.95 3150.58 3187.43 3188.25 3188.31 3191.30 3193.56 3193.81 3194.34 3206.36 3217.33 3233.36 3248.77 3268.53 3276.69
frequency: 6.42 14.46 15.51 18.27 37.22 38.87 74.95 119.13 126.65 133.43 142.67 150.27 183.14 185.20 194.06 208.03 219.63 222.18 237.66 259.86 261.93 269.74 318.63 327.30 366.95 386.66 402.45 421.96 430.83 436.62 489.16 516.91 554.27 595.86 626.63 667.20 694.68 707.64 717.78 742.18 758.52 775.49 775.98 797.23 832.42 844.43 851.28 862.83 864.24 871.29 908.94 941.97 960.79 961.33 969.21 972.27 987.21 1005.26 1013.84 1026.23 1045.87 1058.98 1077.45 1117.87 1133.35 1147.01 1153.89 1168.51 1195.42 1199.78 1219.83 1235.64 1248.35 1278.65 1309.97 1310.30 1324.16 1324.94 1338.17 1362.54 1371.40 1393.69 1417.31 1418.68 1419.37 1427.15 1427.50 1427.82 1432.41 1436.05 1489.23 1509.16 1531.80 1557.12 1666.39 1676.17 1710.27 3074.95 3075.64 3075.79 3087.76 3107.67 3129.95 3150.58 3187.43 3188.25 3188.31 3191.30 3193.56 3193.81 3194.34 3206.36 3217.33 3233.36 3248.77 3268.53 3276.69
formula: C16H20F3AuP
InChI: InChI=1/C13H11F3.C3H9P.Au/c14-13(15,16)12-8-4-7-11(9-12)10-5-2-1-3-6-10;1-4(2)3;/h2,4,7-9H,3,5-6H2;1-3H3;/rC16H20AuF3P/c1-21(2,3)17-15-9-7-12(8-10-15)13-5-4-6-14(11-13)16(18,19)20/h4-6,9,11H,7-8,10H2,1-3H3
41 atoms
C  0.489476 -2.088147 -0.165028
H  1.48888 -1.660149 0.017572
H  0.608713 -2.847706 -0.952271
C  -0.437229 -0.987669 -0.590537
C  -1.433514 -0.595307 0.202749
H  -2.061306 0.263823 -0.01414
C  -1.835343 -1.296399 1.543534
H  -2.318721 -0.566869 2.18625
H  -2.515953 -2.121713 1.327101
C  -0.540445 -1.772214 2.011432
C  0.027108 -2.815575 1.151376
H  0.867241 -3.358635 1.595863
H  -0.770353 -3.520515 0.880719
Au -0.10148 -0.083784 -2.416107
P  0.25951 0.915273 -4.471664
C  -1.26255 1.199842 -5.427821
C  1.054731 2.54928 -4.375196
C  1.326752 -0.053704 -5.582593
H  0.870746 -1.039308 -5.761259
H  1.456527 0.46839 -6.543482
H  2.310249 -0.200594 -5.110991
H  -1.769107 0.239068 -5.605193
H  -1.027165 1.67287 -6.394076
H  -1.93818 1.854024 -4.856265
H  0.424568 3.229317 -3.78227
H  1.195756 2.968513 -5.38375
H  2.032746 2.453307 -3.879683
C  0.199661 -1.138904 3.068042
C  1.578095 -1.407736 3.237603
C  -0.433657 -0.228951 3.947681
C  2.30447 -0.770671 4.23636
H  2.08823 -2.107093 2.574181
C  0.296418 0.38495 4.952414
H  -1.49855 -0.018374 3.857123
C  1.666533 0.122423 5.097185
H  3.371528 -0.972813 4.352155
H  2.235263 0.615315 5.890983
C  -0.367673 1.333586 5.922547
F  0.272302 2.512934 5.966737
F  -0.359891 0.839437 7.171535
F  -1.644022 1.579642 5.597835
totalener: -1397.94617240878824 hartree
nucrepener: 1921.85408233752696 hartree
electener: -3319.71848761131969 hartree
oneelecener: -5767.92221211485139 hartree
twoeener: 2448.20372450353170 hartree
cpcmener: -0.07573883378566 hartree
kineticenergy: 1298.15820159362738 hartree
exchangeener: -105.342704889264 hartree
dispersion: -0.109476291 hartree
temp: 298.15 k
press: 1.00 atm
thermalcorrenthalpy: 0.00094421 hartree
totalenthalpy: -1397.70635150 hartree
vibrat: 0.03409596 hartree
rotat: 0.01723817 hartree
transl: 0.02114289 hartree
total: 0.07247702 hartree
totalentropycorr: -0.07247702 hartree
gibbsenthalpy: -1397.77882851 hartree
gibbsminuselec: 0.27682018 hartree
dispersion: -0.109480224 hartree
dispersion: -0.109592987 hartree
dispersion: -0.107379555 hartree
dispersion: -0.108984412 hartree
dispersion: -0.109567820 hartree
dispersion: -0.109663709 hartree
dispersion: -0.109495614 hartree
dispersion: -0.109249275 hartree
dispersion: -0.109056815 hartree
dispersion: -0.109493845 hartree
dispersion: -0.109468549 hartree
dispersion: -0.109408485 hartree
dispersion: -0.109479465 hartree
dispersion: -0.109622805 hartree
dispersion: -0.109470826 hartree
dispersion: -0.109503347 hartree
dispersion: -0.109452460 hartree
dispersion: -0.109444216 hartree
dispersion: -0.109473018 hartree
dispersion: -0.109461121 hartree
dispersion: -0.109464973 hartree
dispersion: -0.109474964 hartree
dispersion: -0.109481038 hartree
dispersion: -0.109485964 hartree
dispersion: -0.109489731 hartree
dispersion: -0.109489363 hartree
dispersion: -0.109487428 hartree
elementType: C H Au P F
energy: -2098.2942 -675.3680 -675.2249 -675.1986 -287.1983 -282.8742 -281.6223 -281.5725 -281.5459 -281.5074 -281.4395 -281.0352 -280.8398 -280.7230 -280.4755 -280.2446 -280.2433 -280.2388 -280.0445 -279.7413 -182.4214 -132.2882 -132.2877 -132.2369 -116.3588 -67.0928 -66.6212 -66.6148 -39.4537 -36.8889 -36.7551 -28.7679 -27.8145 -25.8592 -25.4082 -25.0908 -24.6369 -24.1342 -23.0087 -22.6273 -22.6229 -21.7427 -21.3231 -20.7737 -20.1510 -19.7745 -19.6735 -19.0002 -18.5936 -18.0025 -17.5141 -17.0933 -16.8333 -16.3817 -16.3289 -16.0300 -15.7179 -15.6743 -15.5155 -15.3415 -15.1381 -15.1244 -15.0969 -15.0773 -14.8129 -14.6542 -14.5988 -14.3973 -14.2592 -14.2550 -13.9745 -13.7755 -13.7544 -13.5054 -13.3433 -13.0899 -12.6624 -12.6206 -12.2606 -11.7594 -11.3210 -11.2528 -11.2486 -11.1511 -10.7857 -9.9911 -9.6203 -9.2508 -1.9830 0.6798 1.0898 1.3411 1.7509 2.4121 2.7100 3.3948 3.9302 4.1840 4.2623 electronvolt
chargesum: 1.0000000
charge: 0.132232 0.053286 0.058894 -0.318989 -0.141585 0.127418 -0.295366 0.131797 0.108317 0.039563 0.165073 0.070092 0.070701 0.035282 0.073988 -0.136322 -0.137130 -0.134463 0.087432 0.075758 0.087614 0.087495 0.075690 0.088544 0.088049 0.076224 0.087218 0.067112 0.030422 0.052140 -0.013480 0.063402 -0.204681 0.051524 0.085180 0.059536 0.070289 0.618118 -0.182694 -0.182245 -0.171436
charge: 0.271353 0.074120 0.070732 -0.641360 -0.283222 0.208712 -0.343171 0.204097 0.215946 -0.378655 0.246839 0.069267 0.095323 -0.047276 0.753949 -0.177132 -0.177431 -0.177198 0.049346 0.040832 0.049099 0.049330 0.040778 0.049196 0.049214 0.040860 0.049061 0.189497 0.096919 0.103146 -0.011268 0.062825 -0.092720 0.063957 0.074350 0.055491 0.060598 0.186139 -0.066130 -0.068238 -0.057175
qa: 0.1322 0.0533 0.0589 -0.3190 -0.1416 0.1274 -0.2954 0.1318 0.1083 0.0396 0.1651 0.0701 0.0707 0.0353 0.0740 -0.1363 -0.1371 -0.1345 0.0874 0.0758 0.0876 0.0875 0.0757 0.0885 0.0880 0.0762 0.0872 0.0671 0.0304 0.0521 -0.0135 0.0634 -0.2047 0.0515 0.0852 0.0595 0.0703 0.6181 -0.1827 -0.1822 -0.1714
va: 4.0254 0.9705 0.9694 3.8795 4.0718 0.9520 3.8636 0.9285 0.9601 4.1285 3.9664 0.9809 0.9824 1.5170 4.1196 3.8994 3.8988 3.9004 0.9874 0.9924 0.9872 0.9873 0.9922 0.9874 0.9875 0.9918 0.9874 3.7760 3.8112 3.8728 3.8570 0.9914 3.7694 1.0210 3.8705 0.9854 0.9947 4.3855 1.1656 1.1662 1.1928
dispersion: -0.109486576 hartree
energy: -1398.056195897177 hartree
dipole: 19.129579354 -18.069279749 1.060299604 5.532846431 -7.256715853 -1.723869422 310.648405311 -311.039270358 -0.390865046
dipolemethod: SCF
magnitude: 2.061246351 au
magnitude: 5.239271852 debye
zeropoint: 0.32704544 hartree
thermalvibcorrection: 0.02043454 hartree
thermalrotcorrection: 0.00141627 hartree
thermaltrasncorrection: 0.00141627 hartree
thermaltotal: -1397.70588337 hartree
thermalcorr: 0.02326709 hartree
nonthermalcorr: 0.32704544 hartree
totalcorr: 0.35031253 hartree
totalenthalpy: -1397.70493916 hartree
vibrat: 0.03832676 hartree
rotat: 0.01723597 hartree
total: 0.07670561 hartree
