program: Orca
programVersion: 6.1.x
elementType: C H H C C H C H H C C H H Au P C C C H H H H H H H H H C C C C H C H C H H O C H H H
elementType: Au
keywords: opt freq wb97x-d3bj def2-svp def2/J tightopt verytightscf
charge: 1
multiplicity: 1
frequency: 0.00 0.00 0.00 0.00 0.00 0.00 8.10 17.81 30.10 35.01 45.41 72.09 99.84 128.83 141.57 145.72 172.56 182.19 191.39 202.56 210.25 215.01 219.49 221.34 232.48 261.48 264.05 289.74 298.63 354.51 365.67 415.98 427.33 449.89 481.90 501.02 520.75 547.16 636.90 653.55 707.70 712.61 753.37 774.19 774.93 781.54 797.97 824.65 829.08 838.19 862.44 863.91 877.58 907.73 941.95 956.72 960.97 961.04 971.60 982.03 996.10 1011.11 1032.60 1035.97 1061.84 1067.57 1076.22 1135.41 1149.01 1173.95 1185.02 1202.36 1205.91 1214.90 1264.80 1277.87 1310.20 1310.92 1312.12 1324.16 1324.69 1356.27 1359.75 1381.14 1411.86 1417.47 1419.45 1419.54 1427.49 1427.70 1432.10 1432.82 1441.04 1463.34 1466.99 1471.90 1484.57 1519.90 1530.82 1604.47 1618.28 1681.09 1692.67 3042.41 3074.39 3075.03 3075.44 3077.18 3081.54 3109.94 3136.49 3168.84 3177.14 3186.62 3186.94 3187.39 3189.93 3192.97 3193.64 3194.12 3207.01 3223.77 3245.32 3262.08 3267.62 3275.11
frequency: 8.10 17.81 30.10 35.01 45.41 72.09 99.84 128.83 141.57 145.72 172.56 182.19 191.39 202.56 210.25 215.01 219.49 221.34 232.48 261.48 264.05 289.74 298.63 354.51 365.67 415.98 427.33 449.89 481.90 501.02 520.75 547.16 636.90 653.55 707.70 712.61 753.37 774.19 774.93 781.54 797.97 824.65 829.08 838.19 862.44 863.91 877.58 907.73 941.95 956.72 960.97 961.04 971.60 982.03 996.10 1011.11 1032.60 1035.97 1061.84 1067.57 1076.22 1135.41 1149.01 1173.95 1185.02 1202.36 1205.91 1214.90 1264.80 1277.87 1310.20 1310.92 1312.12 1324.16 1324.69 1356.27 1359.75 1381.14 1411.86 1417.47 1419.45 1419.54 1427.49 1427.70 1432.10 1432.82 1441.04 1463.34 1466.99 1471.90 1484.57 1519.90 1530.82 1604.47 1618.28 1681.09 1692.67 3042.41 3074.39 3075.03 3075.44 3077.18 3081.54 3109.94 3136.49 3168.84 3177.14 3186.62 3186.94 3187.39 3189.93 3192.97 3193.64 3194.12 3207.01 3223.77 3245.32 3262.08 3267.62 3275.11
formula: C16H23AuOP
InChI: InChI=1/C13H14O.C3H9P.Au/c1-14-13-9-7-12(8-10-13)11-5-3-2-4-6-11;1-4(2)3;/h3,7-10H,4-6H2,1H3;1-3H3;/rC16H23AuOP/c1-18-16-11-7-14(8-12-16)13-5-9-15(10-6-13)17-19(2,3)4/h7-9,11-12H,5-6,10H2,1-4H3
42 atoms
C  -1.032543 -1.246206 0.372647
H  -0.046456 -1.656951 0.649811
H  -1.49749 -1.991161 -0.291031
C  -0.850489 0.068664 -0.348025
C  -1.17421 1.204013 0.275482
H  -1.055639 2.172675 -0.203836
C  -1.699096 1.305196 1.714138
H  -1.255072 2.169159 2.202104
H  -2.786418 1.459662 1.691253
C  -1.445635 0.0292 2.420899
C  -1.926125 -1.131417 1.638793
H  -1.93608 -2.074162 2.194656
H  -2.950485 -0.906179 1.304185
Au -0.075693 0.049372 -2.258679
P  0.800938 0.032602 -4.401868
C  -0.388889 0.49942 -5.698582
C  2.200068 1.173733 -4.638248
C  1.439049 -1.5880 -4.931913
H  0.626989 -2.33016 -4.900257
H  1.839967 -1.528841 -5.955982
H  2.237077 -1.910264 -4.245908
H  -1.237365 -0.201542 -5.687989
H  0.091473 0.476487 -6.689394
H  -0.768422 1.513331 -5.500611
H  1.873402 2.202672 -4.423907
H  2.57405 1.117744 -5.672621
H  3.010913 0.910171 -3.942329
C  -0.740007 -0.077305 3.624827
C  -0.433158 -1.357648 4.198409
C  -0.288128 1.081493 4.332858
C  0.270404 -1.463531 5.367531
H  -0.752381 -2.272001 3.698005
C  0.409578 0.987407 5.514352
H  -0.502119 2.076941 3.943553
C  0.701037 -0.29271 6.047564
H  0.512115 -2.434569 5.804912
H  0.730563 1.894014 6.0275
O  1.363269 -0.489847 7.168126
C  1.83424 0.621299 7.938084
H  0.991831 1.246616 8.270838
H  2.339669 0.18803 8.809546
H  2.549232 1.221487 7.355151
totalener: -1175.60974868315816 hartree
nucrepener: 1612.16575170696228 hartree
electener: -2787.69798384656315 hartree
oneelecener: -4840.14546598040670 hartree
twoeener: 2052.44748213384355 hartree
cpcmener: -0.07064063688447 hartree
kineticenergy: 1077.19272229526223 hartree
exchangeener: -90.232603722029 hartree
dispersion: -0.108876115 hartree
dispersion: -0.108464796 hartree
dispersion: -0.108413120 hartree
dispersion: -0.108387166 hartree
dispersion: -0.108370807 hartree
dispersion: -0.108383454 hartree
dispersion: -0.108381541 hartree
dispersion: -0.108378268 hartree
dispersion: -0.108375770 hartree
dispersion: -0.108372151 hartree
elementType: C H Au P O
energy: -2098.2010 -525.2050 -283.3345 -282.2700 -281.8231 -281.5204 -281.3927 -281.1553 -280.8674 -280.7979 -280.5596 -280.3418 -280.1906 -280.1867 -280.1843 -280.1650 -279.5322 -279.3551 -182.3283 -132.1959 -132.1954 -132.1416 -116.2079 -66.9340 -66.4686 -66.4648 -33.8347 -28.3489 -27.2961 -25.4134 -25.0815 -25.0209 -24.3353 -24.0596 -22.9868 -22.5689 -22.5632 -21.3126 -20.8093 -20.4024 -19.3569 -18.7056 -18.5198 -17.9075 -17.4987 -16.8592 -16.7737 -16.2225 -15.7054 -15.6529 -15.4772 -15.3891 -15.1164 -15.0650 -15.0587 -14.7672 -14.5513 -14.3858 -14.2021 -14.2017 -14.0948 -13.8519 -13.7207 -13.4939 -13.4557 -12.9501 -12.7572 -12.6015 -12.5615 -12.5123 -11.9638 -11.6054 -11.1459 -11.1024 -11.0923 -10.7667 -10.0728 -9.8737 -9.2058 -9.0011 -1.6870 1.1340 1.1859 1.4187 2.3238 2.5918 2.9683 3.4752 3.8829 4.1998 4.2745 electronvolt
chargesum: 1.0000000
charge: 0.126004 0.039734 0.047639 -0.367944 -0.150881 0.112811 -0.294418 0.111676 0.125854 0.058418 0.165862 0.050445 0.059674 0.014609 0.073078 -0.137709 -0.137564 -0.134747 0.086668 0.074137 0.086203 0.086192 0.074340 0.086935 0.087213 0.074201 0.086184 0.019552 0.038976 0.050441 -0.053979 0.058327 -0.115236 0.058056 0.275497 0.047810 0.052991 -0.296106 0.140245 0.071498 0.075888 0.071424
charge: 0.252072 0.065219 0.065800 -0.663947 -0.319618 0.201388 -0.356698 0.198541 0.222104 -0.423719 0.239015 0.059067 0.091953 -0.064781 0.751264 -0.178346 -0.178385 -0.178331 0.048592 0.039930 0.048557 0.048566 0.039842 0.048563 0.048547 0.039802 0.048484 0.176666 0.097248 0.119268 -0.049906 0.061553 -0.072184 0.067498 0.134521 0.054340 0.055697 -0.052471 0.101602 0.035459 0.041822 0.035402
qa: 0.1260 0.0397 0.0476 -0.3679 -0.1509 0.1128 -0.2944 0.1117 0.1259 0.0584 0.1659 0.0504 0.0597 0.0146 0.0731 -0.1377 -0.1376 -0.1347 0.0867 0.0741 0.0862 0.0862 0.0743 0.0869 0.0872 0.0742 0.0862 0.0196 0.0390 0.0504 -0.0540 0.0583 -0.1152 0.0581 0.2755 0.0478 0.0530 -0.2961 0.1402 0.0715 0.0759 0.0714
va: 4.0204 0.9701 0.9665 3.8776 4.0587 0.9423 3.8657 0.9324 0.9392 4.1474 3.9769 0.9833 0.9818 1.5154 4.1044 3.8982 3.8991 3.9005 0.9872 0.9925 0.9874 0.9874 0.9920 0.9877 0.9875 0.9921 0.9873 3.7234 3.8265 3.8419 3.8502 0.9910 3.8472 0.9920 3.8285 0.9997 1.0013 2.2688 3.8564 0.9873 0.9913 0.9873
dispersion: -0.108371225 hartree
energy: -1175.720140251824 hartree
dipole: 14.632778966 -14.206910726 0.425868240 -5.616866069 5.967563244 0.350697176 311.082491049 -307.131139974 3.951351075
dipolemethod: SCF
magnitude: 3.989677629 au
magnitude: 10.140954618 debye
temp: 298.15 k
press: 1.00 atm
zeropoint: 0.35558737 hartree
thermalvibcorrection: 0.01928286 hartree
thermalrotcorrection: 0.00141627 hartree
thermaltrasncorrection: 0.00141627 hartree
thermaltotal: -1175.34243748 hartree
thermalcorr: 0.02211540 hartree
nonthermalcorr: 0.35558737 hartree
totalcorr: 0.37770277 hartree
thermalcorrenthalpy: 0.00094421 hartree
totalenthalpy: -1175.34149327 hartree
vibrat: 0.03539870 hartree
rotat: 0.01693243 hartree
transl: 0.02103039 hartree
total: 0.07336151 hartree
totalentropycorr: -0.07336151 hartree
gibbsenthalpy: -1175.41485478 hartree
gibbsminuselec: 0.30528547 hartree
