program: Orca
programVersion: 6.1.x
elementType: C H H C C H C H H C C H H Au P C C C H H H H H H H H H C C C C H C H C H H C C H H H
elementType: Au
keywords: opt freq wb97x-d3bj def2-svp def2/J tightopt verytightscf
charge: 1
multiplicity: 1
frequency: 0.00 0.00 0.00 0.00 0.00 0.00 10.49 14.07 33.20 34.24 45.44 62.03 94.41 107.28 128.18 141.94 171.89 183.13 189.32 196.32 210.32 218.84 219.80 222.88 260.94 262.78 271.34 296.91 352.28 365.70 407.16 426.21 450.70 461.79 490.82 497.31 547.94 633.69 645.74 661.90 707.47 715.93 756.66 774.75 774.85 797.47 803.19 818.68 833.08 858.86 862.25 863.28 893.80 903.63 932.41 955.64 960.38 961.31 970.44 982.53 995.91 1008.27 1027.79 1037.99 1042.80 1044.41 1048.52 1059.61 1066.87 1128.23 1161.66 1172.96 1185.49 1211.30 1257.07 1266.90 1269.94 1301.25 1309.91 1310.28 1318.57 1324.06 1335.20 1355.72 1359.30 1401.74 1417.07 1419.24 1419.45 1426.76 1427.38 1428.24 1432.57 1438.70 1441.47 1474.43 1490.46 1510.43 1572.48 1625.36 1679.48 1691.10 1737.46 3052.52 3074.55 3075.21 3075.48 3081.67 3116.43 3142.11 3176.50 3180.14 3184.63 3187.18 3187.36 3187.52 3193.25 3193.44 3193.84 3207.42 3215.93 3233.95 3246.33 3268.98 3273.13 3282.77
frequency: 10.49 14.07 33.20 34.24 45.44 62.03 94.41 107.28 128.18 141.94 171.89 183.13 189.32 196.32 210.32 218.84 219.80 222.88 260.94 262.78 271.34 296.91 352.28 365.70 407.16 426.21 450.70 461.79 490.82 497.31 547.94 633.69 645.74 661.90 707.47 715.93 756.66 774.75 774.85 797.47 803.19 818.68 833.08 858.86 862.25 863.28 893.80 903.63 932.41 955.64 960.38 961.31 970.44 982.53 995.91 1008.27 1027.79 1037.99 1042.80 1044.41 1048.52 1059.61 1066.87 1128.23 1161.66 1172.96 1185.49 1211.30 1257.07 1266.90 1269.94 1301.25 1309.91 1310.28 1318.57 1324.06 1335.20 1355.72 1359.30 1401.74 1417.07 1419.24 1419.45 1426.76 1427.38 1428.24 1432.57 1438.70 1441.47 1474.43 1490.46 1510.43 1572.48 1625.36 1679.48 1691.10 1737.46 3052.52 3074.55 3075.21 3075.48 3081.67 3116.43 3142.11 3176.50 3180.14 3184.63 3187.18 3187.36 3187.52 3193.25 3193.44 3193.84 3207.42 3215.93 3233.95 3246.33 3268.98 3273.13 3282.77
formula: C17H23AuP
InChI: InChI=1/C14H14.C3H9P.Au/c1-2-12-8-10-14(11-9-12)13-6-4-3-5-7-13;1-4(2)3;/h2,4,8-11H,1,5-7H2;1-3H3;/rC17H23AuP/c1-5-14-6-8-15(9-7-14)16-10-12-17(13-11-16)18-19(2,3)4/h5-9,12H,1,10-11,13H2,2-4H3
42 atoms
C  -1.367093 -0.913333 0.5612
H  -0.521507 -1.560982 0.848197
H  -2.012527 -1.519175 -0.09265
C  -0.852985 0.302732 -0.165986
C  -0.880259 1.490681 0.439242
H  -0.505777 2.392305 -0.038317
C  -1.391145 1.744091 1.872227
H  -0.760081 2.485246 2.354904
H  -2.412193 2.143136 1.81928
C  -1.440203 0.451934 2.578338
C  -2.205522 -0.55907 1.82977
H  -2.441356 -1.462165 2.400611
H  -3.140141 -0.092529 1.484716
Au -0.10256 0.064151 -2.072448
P  0.736573 -0.201536 -4.213545
C  -0.181577 0.718585 -5.487879
C  2.461466 0.346375 -4.40925
C  0.73433 -1.923841 -4.802695
H  -0.295751 -2.311338 -4.799017
H  1.142979 -1.98263 -5.823639
H  1.345536 -2.542984 -4.128673
H  -1.229956 0.383927 -5.497967
H  0.264763 0.552026 -6.48081
H  -0.157662 1.793417 -5.25261
H  2.538044 1.414412 -4.154906
H  2.799764 0.192907 -5.446021
H  3.107761 -0.225121 -3.725915
C  -0.71938 0.171628 3.763779
C  -0.679601 -1.147988 4.296755
C  -0.001723 1.19034 4.456807
C  0.04573 -1.427381 5.437921
H  -1.214166 -1.958919 3.802135
C  0.709259 0.905146 5.603727
H  -0.015952 2.217778 4.093311
C  0.750821 -0.410566 6.116444
H  0.073759 -2.447601 5.828857
H  1.244009 1.709527 6.111891
C  1.499489 -0.76709 7.334791
C  2.188466 0.087332 8.102634
H  1.466644 -1.827501 7.607343
H  2.71515 -0.271222 8.992585
H  2.256163 1.158062 7.886224
totalener: -1138.50998089970585 hartree
nucrepener: 1575.67498634476306 hartree
electener: -2714.10672888779209 hartree
oneelecener: -4714.91888845379799 hartree
twoeener: 2000.81215956600613 hartree
cpcmener: -0.07021906103199 hartree
kineticenergy: 1040.25110848202507 hartree
exchangeener: -87.960531616440 hartree
dispersion: -0.111672155 hartree
dispersion: -0.111246939 hartree
dispersion: -0.111196879 hartree
dispersion: -0.111176159 hartree
dispersion: -0.111155521 hartree
dispersion: -0.111166063 hartree
dispersion: -0.111168042 hartree
dispersion: -0.111167979 hartree
elementType: C H Au P
energy: -2098.2270 -282.5812 -281.6769 -281.3551 -281.3373 -281.2845 -280.8386 -280.8254 -280.6869 -280.6778 -280.6668 -280.4862 -280.2752 -280.2049 -280.2026 -280.1982 -279.6699 -279.4474 -182.3543 -132.2216 -132.2211 -132.1684 -116.2496 -66.9780 -66.5107 -66.5070 -28.4788 -27.5447 -25.9628 -25.0447 -24.9450 -24.7226 -24.3727 -23.5454 -22.5851 -22.5810 -21.6041 -21.1912 -20.3646 -19.6055 -19.1624 -18.5480 -18.2754 -17.3798 -16.8233 -16.5747 -16.1747 -15.7226 -15.5243 -15.5158 -15.3526 -15.0856 -15.0817 -14.8819 -14.8543 -14.5906 -14.4380 -14.2183 -14.2168 -13.8851 -13.8574 -13.7361 -13.4814 -13.2157 -12.9503 -12.7844 -12.5935 -12.5648 -12.1042 -12.0622 -11.6530 -11.1982 -11.1447 -11.1344 -10.5795 -9.9654 -9.8740 -9.3046 -9.0644 -2.0901 1.0202 1.1612 1.3059 1.4008 2.5203 2.9037 3.3424 3.5741 3.9666 4.1825 electronvolt
chargesum: 1.0000000
charge: 0.125826 0.044606 0.053380 -0.359409 -0.150817 0.117832 -0.289078 0.114983 0.128299 0.059003 0.165895 0.058341 0.065542 0.021230 0.073380 -0.137163 -0.138119 -0.134107 0.086724 0.074546 0.086475 0.086614 0.074608 0.087443 0.087631 0.074821 0.086589 0.047045 0.034456 0.032361 -0.034590 0.055668 -0.033450 0.050838 0.060288 0.044408 0.041889 -0.044734 -0.017980 0.045087 0.078501 0.075135
charge: 0.260253 0.067596 0.068548 -0.660073 -0.311506 0.203460 -0.351339 0.200005 0.224065 -0.395086 0.243283 0.062848 0.095131 -0.060036 0.752083 -0.177958 -0.178225 -0.177910 0.048776 0.040185 0.048664 0.048824 0.040090 0.048754 0.048756 0.040107 0.048695 0.184431 0.094887 0.096218 -0.020559 0.060526 -0.016295 0.064591 0.052576 0.050984 0.050033 -0.041556 0.014596 0.045507 0.045702 0.040367
qa: 0.1258 0.0446 0.0534 -0.3594 -0.1508 0.1178 -0.2891 0.1150 0.1283 0.0590 0.1659 0.0583 0.0655 0.0212 0.0734 -0.1372 -0.1381 -0.1341 0.0867 0.0745 0.0865 0.0866 0.0746 0.0874 0.0876 0.0748 0.0866 0.0470 0.0345 0.0324 -0.0346 0.0557 -0.0334 0.0508 0.0603 0.0444 0.0419 -0.0447 -0.0180 0.0451 0.0785 0.0751
va: 4.0222 0.9707 0.9668 3.8781 4.0679 0.9437 3.8552 0.9332 0.9414 4.1282 3.9758 0.9823 0.9819 1.5153 4.1095 3.8986 3.8986 3.9006 0.9873 0.9925 0.9873 0.9874 0.9920 0.9876 0.9875 0.9921 0.9874 3.7269 3.8233 3.8509 3.8405 0.9907 3.8724 0.9919 3.7662 0.9927 0.9938 3.9758 3.9187 0.9894 0.9770 0.9819
dispersion: -0.111167229 hartree
energy: -1138.623163079420 hartree
dipole: 16.134872171 -16.108667861 0.026204310 -8.897146224 8.643314736 -0.253831488 299.245216461 -296.137878348 3.107338113
dipolemethod: SCF
magnitude: 3.117798460 au
magnitude: 7.924813890 debye
temp: 298.15 k
press: 1.00 atm
zeropoint: 0.35563968 hartree
thermalvibcorrection: 0.01911783 hartree
thermalrotcorrection: 0.00141627 hartree
thermaltrasncorrection: 0.00141627 hartree
thermaltotal: -1138.24557302 hartree
thermalcorr: 0.02195037 hartree
nonthermalcorr: 0.35563968 hartree
totalcorr: 0.37759006 hartree
thermalcorrenthalpy: 0.00094421 hartree
totalenthalpy: -1138.24462881 hartree
vibrat: 0.03509871 hartree
rotat: 0.01690917 hartree
transl: 0.02101804 hartree
total: 0.07302592 hartree
totalentropycorr: -0.07302592 hartree
gibbsenthalpy: -1138.31765474 hartree
gibbsminuselec: 0.30550834 hartree
