program: Gaussian 09
title: 000076819
version: EM64L-G09RevD.01
frameworkgroup: C1[X(C8H9N5)]
method: RPBEPBE
basis: SDD
operation: Freq
keyword: #p
keyword: freq=noraman
keyword: PBEPBE/SDD
title: #p freq=noraman PBEPBE/SDD
converged: YES YES NO YES
title: Mulliken charges:
elementType: N N N N N C C C C C C C C H H H H H H H H H
charge: -0.417313 -0.427028 -0.203311 -0.102019 -0.617724 0.457149 0.094204 -0.451812 -0.347561 -0.198607 -0.229016 0.219366 -0.265620 0.320135 0.217695 0.304861 0.220454 0.218712 0.223315 0.320429 0.344818 0.318873
chargesum: 0.00000
title: Mulliken charges with hydrogens summed into heavy atoms:
elementType: N N N N N C C C C C C C C
charge: -0.097178 -0.106599 -0.203311 -0.102019 0.045967 0.457149 0.094204 -0.234117 -0.042700 0.021847 -0.010304 0.219366 -0.042305
polarizability: 2.10486836e+02 -2.65002046e-01 1.17263108e+02 -4.92079271e-03 2.36406942e-04 4.90097430e+01
1716.lowfreq: -4.0444 0.0001 0.0005 0.0007 4.0359 14.6909 49.9798 71.2591 113.6805
frequency: 49.9725 71.2542 113.6723 183.5425 193.9030 253.2578 263.0333 310.8866 351.6935 405.3699 412.3948 415.6145 504.5942 518.3506 571.0377 602.0261 614.1780 654.9275 697.5255 715.1612 717.5477 760.2609 780.6099 836.7448 847.6508 903.0572 940.9812 965.0388 982.6586 991.3396 992.8303 1025.9522 1039.9954 1088.1038 1107.6964 1170.1023 1191.8000 1229.8755 1277.2127 1329.8258 1344.4067 1383.3976 1410.7795 1447.0519 1486.6132 1520.8718 1555.6155 1592.0087 1601.8709 1621.0575 1654.4626 3108.9627 3126.0063 3138.2666 3161.0231 3177.3053 3558.2117 3582.9136 3631.3506 3728.5552
redmass: 5.7077 4.5050 4.9779 1.6990 2.0053 4.8308 4.8263 5.6492 8.1102 1.1252 2.9579 3.5492 2.1885 1.3458 1.3055 6.2134 6.4109 4.4490 1.9730 9.4264 6.5899 1.7031 6.6909 1.2730 5.5969 1.4352 6.4319 1.3428 6.1600 1.2976 1.9105 2.2245 4.3077 1.7473 3.8942 1.0511 1.1174 2.4646 3.4357 1.3930 1.4185 5.7199 4.0225 2.6609 2.3190 2.2639 5.2568 2.6143 1.9094 5.6997 3.7213 1.0876 1.0866 1.0934 1.0988 1.0961 1.0756 1.0453 1.0825 1.1052
irintensity: 2.9383 0.8266 2.2717 55.3530 46.0885 6.9473 7.2487 0.1792 0.5335 198.2153 0.2011 2.3965 0.7784 216.8652 59.1528 6.5379 2.2966 26.9318 50.2257 6.8272 6.6755 90.3463 2.1007 0.3129 3.2429 14.3325 15.5298 0.0117 3.3355 2.6982 0.1396 9.1864 8.5961 10.1006 8.2300 0.7754 5.2754 38.0460 0.0212 10.3919 4.6236 29.9895 25.3176 49.2082 19.1491 51.2108 1125.9428 1.8175 216.7824 222.3337 123.8092 15.0376 1.1979 38.7301 25.2357 12.0707 35.4317 114.6249 51.0867 48.2188
temp: 298.150 k
press: 1.00000 atm
elementType: 7 7 7 7 7 6 6 6 6 6 6 6 6 1 1 1 1 1 1 1 1 1
symmnumber: 1
zpe: 448075.7 jmol-1
zpe.correction: 0.170663 hartree
zpe.thermalcorrener: 0.181789 hartree
zpe.thermalcorrenthalpy: 0.182733 hartree
zpe.thermalcorrgfe: 0.133425 hartree
zpe.sumelectzpe: -583.076901 hartree
zpe.sumelectthermal: -583.065775 hartree
zpe.sumelectthermalent: -583.064831 hartree
zpe.sumelectthermalfe: -583.114139 hartree
dipole: 4.9427 0.3751 0.0032
dipole: 4.9569
quadrupole: -42.3534 -66.9046 -82.5747
quadrupole: 7.7160 0.0030 -0.0003
quadrupole: 21.5908 -2.9603 -18.6305 7.7160 0.0030 -0.0003
hfenergy: -583.2475643 hartree
pointgroup: C01 [X(C8H9N5)]
dipole: 1.9423152 -0.1744849 0.0144852 debye
dipolederiv: -2.146123 0.1242309 -0.0134016 0.0631746 -0.2844817 -0.0021055 -0.0111148 -0.0021044 -0.3367345 -0.6790316 0.2088394 -0.0100173 -0.164028 -0.4371485 0.0050292 0.0045447 0.0068885 -0.2946153 -1.5127761 0.056198 -0.0075817 0.1681155 -0.4916938 0.0084549 -0.0117487 0.0080345 -0.2894192 -0.020979 -0.2748791 0.0115548 0.3337866 -0.5297049 0.0136874 -0.0119814 0.0109185 -0.2125352 -1.663692 -0.2193011 0.0047069 -0.2581936 -0.2396567 -0.0209839 0.0067393 -0.0207504 -0.7486174 1.6577734 0.1769739 0.0009205 0.6938631 0.0675578 0.0051736 -0.0189153 0.0027375 0.1118627 2.0666012 -0.2555704 0.0184754 -0.7086848 0.5113666 -0.0180154 0.0353653 -0.0158914 0.1276888 -0.4802451 -0.0832167 0.001986 0.1813792 0.0661901 -0.0101291 -0.0080332 -0.011463 -0.2302837 -0.3311811 0.0167777 -0.0011859 -0.4594527 -0.1066063 -0.0055211 0.0168638 -0.0032107 -0.1931946 0.1903807 0.0386885 0.0002146 -0.0256484 0.1464591 -0.0109178 0.0025549 -0.0105755 -0.1408276 0.1990823 -0.0522807 0.0036687 0.089971 0.1709333 -0.0115541 -0.0017077 -0.0123435 -0.1450465 1.9933917 0.171289 0.0007993 0.0240995 0.739802 -0.0199577 0.0063258 -0.0193837 0.2169712 -0.1563511 0.0734547 -0.0023217 0.0208735 -0.187745 -0.00076 -0.0002909 -0.0004869 -0.2121835 0.1621701 0.0137525 -0.0012875 0.0118944 0.1775491 0.0056192 -0.0009983 0.0058476 0.3210383 0.0569092 -0.0880908 0.0027226 -0.0525235 -0.1181824 0.0104741 0.0014691 0.0102881 0.169274 0.1560462 0.0583606 -0.002381 0.064577 0.0613323 0.0047098 -0.0025337 0.0047394 0.1779771 -0.054383 0.1113938 -0.0052395 0.1305959 -0.0185328 0.0071771 -0.0059655 0.0070997 0.1554155 0.0647621 -0.0365672 0.0009359 -0.0741489 -0.1272053 0.0101338 0.0023548 0.0103639 0.1505209 -0.1363918 -0.0657346 0.0008247 -0.0685894 0.0646169 0.0037148 0.0008821 0.0037278 0.1733673 0.1612337 -0.014152 -0.0003449 -0.0196272 0.1900001 0.0070714 -0.0000351 0.0069558 0.3788136 0.2256131 0.0383665 -0.0022829 0.0889723 0.204262 0.0083426 -0.00425 0.008083 0.4098034 0.2471901 0.0014671 -0.0007654 -0.0404061 0.1408881 0.0103565 0.0004748 0.0105251 0.4107246 unknown
polarizability: 210.4722444|-1.016493|117.1761927|0.8019199|-2.5832705|49.1112494 unknown
InChI: InChI=1S/C8H9N5/c9-7-11-8(13-12-7)10-6-4-2-1-3-5-6/h1-5,10,12H,9H2
charge 0 multiplicity 1
22 atoms
N  0.019924 0.910252 -0.045001
N  2.788013 -1.245126 0.049285
N  2.409807 0.958495 -0.03668
N  1.36725 -1.138998 0.039159
N  4.726024 0.251182 -0.00025
C  -1.299792 0.412271 -0.032842
C  1.219954 0.218751 -0.013397
C  -2.365645 1.356461 -0.073528
C  -1.599741 -0.977894 0.017942
C  -3.704363 0.919737 -0.064035
C  -2.947839 -1.396086 0.026769
C  3.371821 0.003925 0.003738
C  -4.008455 -0.462111 -0.013895
H  0.143564 1.923147 -0.083758
H  -2.14015 2.430252 -0.112405
H  -0.78287 -1.702035 0.049567
H  -4.511911 1.660143 -0.095876
H  -3.168706 -2.469312 0.066221
H  -5.049893 -0.800807 -0.006797
H  3.198953 -2.173343 0.086122
H  5.026888 1.220351 -0.036405
H  5.41817 -0.489357 0.031768
