program: Orca
programVersion: 6.1.x
elementType: C H H C C H C H H C C H H Au P C C C H H H H H H H H H C C C C H C H C H H C H H H
elementType: Au
charge: 1
multiplicity: 1
keywords: wb97x-d3bj def2-TZVPPD def2/J defgrid3 verytightscf
formula: C16H23AuP
InChI: InChI=1/C13H14.C3H9P.Au/c1-4-5-6-12(3)13-9-7-11(2)8-10-13;1-4(2)3;/h1,7-10H,3,5-6H2,2H3;1-3H3;/rC16H23AuP/c1-13-6-9-15(10-7-13)14(2)8-11-16-12-17(16)18(3,4)5/h6-7,9-10,12H,2,8,11H2,1,3-5H3
41 atoms
C  -2.824041 -1.260756 0.546457
H  -1.951029 -1.798605 0.919349
H  -3.632037 -1.987119 0.42778
C  -2.529091 -0.716678 -0.785348
C  -2.466172 -0.237019 -1.905667
H  -2.62277 0.132794 -2.900405
C  -2.426956 2.165056 1.327339
H  -1.699796 2.956886 1.470856
H  -3.37407 2.438861 0.87369
C  -2.192772 0.90904 1.707954
C  -3.251881 -0.149656 1.519799
H  -3.496579 -0.624916 2.472504
H  -4.163502 0.319574 1.147222
Au -0.340307 -0.142345 -1.238134
P  1.933051 0.090885 -1.36235
C  2.511145 -0.274208 -3.03613
C  2.549814 1.748761 -1.000965
C  2.835009 -1.044034 -0.285999
H  2.572268 -2.070415 -0.548035
H  3.909307 -0.895893 -0.418524
H  2.564619 -0.859977 0.753797
H  2.229324 -1.293604 -3.30483
H  3.59798 -0.171355 -3.079621
H  2.050571 0.420095 -3.740906
H  2.080136 2.462164 -1.680377
H  3.633164 1.771302 -1.140388
H  2.309607 2.022531 0.025776
C  -0.89025 0.497032 2.302913
C  -0.805079 -0.577145 3.193837
C  0.289317 1.174475 1.988869
C  0.406973 -0.941876 3.762132
H  -1.695686 -1.133938 3.461537
C  1.498407 0.813666 2.568268
H  0.265347 1.989642 1.274639
C  1.580986 -0.251205 3.462302
H  0.441251 -1.778579 4.453768
H  2.399682 1.360049 2.308295
C  2.897314 -0.668013 4.063586
H  2.837103 -0.702349 5.154688
H  3.180951 -1.667757 3.721259
H  3.693676 0.024957 3.785427
elementType: C H Au P
totalener: -1101.07018525158514 hartree
nucrepener: 1656.89812248698081 hartree
electener: -2757.88729887988893 hartree
oneelecener: -4826.49458178707391 hartree
twoeener: 2068.60728290718498 hartree
cpcmener: -0.07606066580698 hartree
kineticenergy: 1007.18881689480327 hartree
exchangeener: -84.641057787715 hartree
energy: -2098.8414 -281.5543 -281.0621 -280.7613 -280.2511 -280.1329 -280.1087 -280.0624 -279.9192 -279.9158 -279.9055 -279.8631 -279.8563 -279.7579 -279.7512 -279.5028 -279.4518 -182.6043 -132.3406 -132.3392 -132.3140 -117.2591 -67.9966 -67.5998 -67.5126 -27.7103 -26.9713 -26.0377 -25.5314 -24.8777 -24.3115 -24.0786 -23.1204 -23.0831 -22.3689 -21.7376 -20.1433 -19.8758 -18.9459 -18.7789 -18.4560 -17.2796 -16.6202 -16.2891 -16.1138 -15.8764 -15.5983 -15.4618 -15.4307 -15.1871 -14.9387 -14.7476 -14.6663 -14.5713 -14.5202 -14.4457 -14.0095 -13.9535 -13.5496 -13.4266 -13.2497 -13.1240 -13.0817 -12.8942 -12.5806 -12.3416 -12.2546 -12.1479 -12.1328 -12.0213 -11.4719 -11.0451 -10.7411 -10.3459 -9.7696 -8.8909 0.3595 0.7798 1.0610 1.2772 1.4995 1.5804 1.7330 1.8556 2.1072 2.1366 2.1978 electronvolt
chargesum: 1.0000000
charge: 0.407410 0.117356 0.089950 -0.479964 0.018507 0.093457 -0.060232 0.096529 0.053628 -0.127400 -0.145995 0.103212 0.141999 -0.121432 0.705639 -0.522995 -0.294346 -0.190815 0.135981 0.175895 -0.040726 0.153518 0.161783 0.155740 0.122345 0.165532 0.077794 0.408472 -0.035875 -0.410013 -0.414628 0.014917 0.017198 -0.022383 0.984893 -0.008851 -0.153648 -0.770314 0.168012 0.128896 0.100957
charge: -0.009910 0.020171 0.040904 -0.154220 0.104464 -0.040339 0.217575 -0.027118 -0.021891 -0.219786 0.009402 0.022556 0.027805 0.695630 0.756962 -0.015206 0.005475 0.009350 -0.037229 -0.028018 -0.067949 -0.042702 -0.033248 -0.042145 -0.036872 -0.029107 -0.067488 -0.169348 0.054422 0.020259 0.049778 0.013826 0.021574 -0.001248 -0.209353 0.021339 0.013200 0.163587 -0.003545 -0.002422 -0.009135
qa: 0.4074 0.1174 0.0899 -0.4800 0.0185 0.0935 -0.0602 0.0965 0.0536 -0.1274 -0.1460 0.1032 0.1420 -0.1214 0.7056 -0.5230 -0.2943 -0.1908 0.1360 0.1759 -0.0407 0.1535 0.1618 0.1557 0.1223 0.1655 0.0778 0.4085 -0.0359 -0.4100 -0.4146 0.0149 0.0172 -0.0224 0.9849 -0.0089 -0.1536 -0.7703 0.1680 0.1289 0.1010
va: 3.9189 0.9715 1.0269 4.0373 3.7593 1.0259 3.7147 0.9582 1.0419 2.6046 4.1579 1.0404 0.9703 1.8676 3.8453 4.0542 4.0136 4.0421 1.0933 1.0484 1.2882 1.0661 1.0834 1.0635 1.0972 1.0863 1.0942 1.4647 2.9929 3.0811 3.3430 0.8942 3.1767 0.9284 1.7037 1.0165 1.0332 3.7652 0.9961 1.0343 1.0554
dispersion: -0.116303611 hartree
energy: -1101.186488862601 hartree
dipole: 56.012416010 -54.991254199 1.021161811 19.203821883 -19.700186348 -0.496364466 190.621878613 -192.150748265 -1.528869652
dipolemethod: SCF
magnitude: 1.904361189 au
magnitude: 4.840501462 debye
