program: Orca
programVersion: 6.1.x
elementType: C H H C C H C H H C C H H Au P C C C H H H H H H H H H C C C C H C H C N O O C N C N
elementType: Au
charge: 1
multiplicity: 1
keywords: wb97x-d3bj def2-TZVPPD def2/J defgrid3 verytightscf
formula: C17H18AuN3O2P
InChI: InChI=1/C14H9N3O2.C3H9P.Au/c1-3-4-5-10(2)11-6-12(8-15)14(17(18)19)13(7-11)9-16;1-4(2)3;/h1,6-7H,2,4-5H2;1-3H3;/rC17H18AuN3O2P/c1-12(5-6-16-9-18(16)24(2,3)4)13-7-14(10-19)17(21(22)23)15(8-13)11-20/h7-9H,1,5-6H2,2-4H3
42 atoms
C  -1.059361 -1.04015 3.010134
H  -0.322538 -1.587079 2.418183
H  -1.299293 -1.650811 3.884335
C  -2.301336 -0.8974 2.240292
C  -3.422331 -0.778324 1.773982
H  -4.473859 -0.74435 1.563588
C  -0.737305 2.197507 1.857617
H  -0.413355 2.814444 1.026678
H  -1.659403 2.482158 2.352771
C  -0.032595 1.153928 2.294365
C  -0.513139 0.32677 3.458103
H  0.290171 0.147142 4.174088
H  -1.297485 0.871266 3.984561
Au -2.155098 -0.295472 0.00284
P  -1.611172 0.026792 -2.198928
C  -3.013212 -0.391555 -3.260236
C  -1.156166 1.707754 -2.678372
C  -0.265437 -1.053983 -2.730597
H  -0.600659 -2.090469 -2.657916
H  0.007669 -0.828417 -3.76369
H  0.599993 -0.920244 -2.083083
H  -3.320153 -1.421437 -3.072035
H  -2.722587 -0.281066 -4.307698
H  -3.848313 0.27595 -3.041151
H  -1.972555 2.38593 -2.423716
H  -0.980386 1.736254 -3.756254
H  -0.252479 2.027777 -2.161587
C  1.227755 0.746266 1.612982
C  2.258809 0.110567 2.299766
C  1.401156 0.9947 0.253519
C  3.447651 -0.233169 1.658084
H  2.168106 -0.121215 3.352387
C  2.571844 0.642312 -0.407427
H  0.613625 1.467615 -0.313187
C  3.599956 0.032802 0.302895
N  4.842334 -0.342356 -0.386812
O  5.88261 -0.184014 0.216103
O  4.737804 -0.782564 -1.513197
C  4.460449 -0.900167 2.436319
N  5.211788 -1.445566 3.111686
C  2.655597 0.952853 -1.811929
N  2.619973 1.240516 -2.923001
elementType: C H Au P N O
totalener: -1450.90968112104088 hartree
nucrepener: 2375.49821817464408 hartree
electener: -3826.29079113680154 hartree
oneelecener: -6728.29746669723681 hartree
twoeener: 2902.00667556043527 hartree
cpcmener: -0.11679629279507 hartree
kineticenergy: 1355.90038919666949 hartree
exchangeener: -112.596336625051 hartree
energy: -2098.9149 -524.8604 -524.8514 -399.9538 -393.0603 -393.0125 -282.8538 -282.2902 -282.2840 -281.6520 -281.6495 -281.5904 -281.4197 -281.3098 -281.2938 -281.1609 -280.9486 -280.7594 -280.3417 -280.0706 -279.9838 -279.9691 -279.9612 -182.6764 -132.4118 -132.4117 -132.3869 -117.3383 -68.0712 -67.6830 -67.5934 -38.5499 -33.6506 -29.8643 -29.3695 -28.9854 -27.6349 -26.8647 -26.4965 -25.8983 -25.5829 -24.7180 -23.8137 -23.1836 -23.1333 -22.6792 -21.8301 -21.6854 -20.5784 -19.4777 -19.3095 -19.0101 -18.8517 -18.5212 -18.0233 -17.7467 -17.5254 -17.5005 -16.6821 -16.4754 -15.9960 -15.7992 -15.5192 -15.4672 -15.4122 -15.1073 -14.9175 -14.6445 -14.6024 -14.4593 -14.2929 -14.2677 -14.1197 -14.0250 -13.9491 -13.6244 -13.5448 -13.2819 -13.2606 -13.1970 -13.0914 -12.9227 -12.6612 -12.4767 -12.4259 -12.3669 -12.2831 -12.2210 -12.1851 -11.7890 -11.4586 -11.0912 -10.8098 -10.4451 -9.8523 -1.3688 -0.5876 0.3261 0.4325 1.0563 1.1954 1.4239 1.4509 1.5766 1.7593 1.9205 electronvolt
chargesum: 1.0000000
charge: 0.350098 0.100359 0.099636 -0.442953 0.016451 0.083574 0.200493 0.087960 0.015646 -0.513941 -0.129230 0.107528 0.140333 -0.138764 0.737405 -0.536287 -0.195214 -0.199607 0.144159 0.143433 0.021206 0.160990 0.164194 0.154889 0.130603 0.158528 0.046349 0.764422 0.226898 -0.364711 0.514623 -0.018320 0.784871 0.314686 0.067641 0.910326 -0.494319 -0.492744 -0.583479 -0.301033 -0.892886 -0.343816
charge: -0.001170 0.032453 0.042763 -0.148968 0.105952 -0.039005 0.230357 -0.015865 -0.010622 -0.206106 0.019256 0.021966 0.032574 0.691643 0.758822 -0.012974 0.002630 -0.000258 -0.038098 -0.029769 -0.067177 -0.042784 -0.031756 -0.041162 -0.037170 -0.029217 -0.068920 -0.088204 0.152608 0.125704 -0.091748 0.039396 -0.093021 -0.001753 -0.034486 -0.320687 0.096977 0.093882 -0.153410 0.151975 -0.162609 0.167981
qa: 0.3501 0.1004 0.0996 -0.4430 0.0165 0.0836 0.2005 0.0880 0.0156 -0.5139 -0.1292 0.1075 0.1403 -0.1388 0.7374 -0.5363 -0.1952 -0.1996 0.1442 0.1434 0.0212 0.1610 0.1642 0.1549 0.1306 0.1585 0.0463 0.7644 0.2269 -0.3647 0.5146 -0.0183 0.7849 0.3147 0.0676 0.9103 -0.4943 -0.4927 -0.5835 -0.3010 -0.8929 -0.3438
va: 4.0738 1.0012 0.9878 4.0599 3.7294 1.0232 3.5330 0.9276 1.0440 2.7184 4.3294 1.0224 0.9698 1.8375 3.7999 4.0497 3.9460 4.0284 1.0713 1.0794 1.1512 1.0563 1.0771 1.0608 1.0788 1.0970 1.0645 -0.4601 2.2114 0.2140 1.8933 0.9054 1.7465 0.2394 3.5583 3.8654 1.7700 1.7756 2.2486 2.3722 1.4932 2.3547
dispersion: -0.129986720 hartree
energy: -1451.039667841095 hartree
dipole: 297.259346699 -303.826039365 -6.566692666 40.133202686 -39.425412370 0.707790316 10.259164126 -9.613082936 0.646081190
dipolemethod: SCF
magnitude: 6.636252000 au
magnitude: 16.868012062 debye
