program: Orca
programVersion: 6.1.x
elementType: C H H C C H C H H C C H H Au P C C C H H H H H H H H H C C C C H C H C H H N C C H H C H H C H H H H
elementType: Au
charge: 1
multiplicity: 1
keywords: wb97x-d3bj def2-TZVPPD def2/J defgrid3 verytightscf
formula: C19H28AuNP
InChI: InChI=1/C16H19N.C3H9P.Au/c1-3-4-7-14(2)15-8-10-16(11-9-15)17-12-5-6-13-17;1-4(2)3;/h1,8-11H,2,4-7,12-13H2;1-3H3;/rC19H28AuNP/c1-16(7-10-18-15-20(18)22(2,3)4)17-8-11-19(12-9-17)21-13-5-6-14-21/h8-9,11-12,15H,1,5-7,10,13-14H2,2-4H3
50 atoms
C  -2.726093 -1.485601 1.746517
H  -1.786685 -1.954787 1.451698
H  -3.478921 -2.2749 1.812185
C  -3.144665 -0.552012 0.692204
C  -3.619496 0.263197 -0.081243
H  -4.218904 0.947053 -0.649738
C  -2.241237 1.649104 3.425676
H  -1.649995 2.558837 3.419403
H  -3.264231 1.724627 3.780483
C  -1.737922 0.477859 3.033029
C  -2.585425 -0.771029 3.102297
H  -2.15365 -1.490014 3.803775
H  -3.57638 -0.507356 3.474999
Au -1.538521 0.009696 -0.865306
P  0.254204 0.101872 -2.282079
C  -0.216931 -0.386816 -3.957465
C  0.95323 1.75857 -2.447366
C  1.617308 -0.993871 -1.834141
H  1.256714 -2.023731 -1.810946
H  2.412271 -0.901243 -2.577692
H  1.997585 -0.727899 -0.850084
H  -0.589256 -1.41257 -3.945184
H  0.65074 -0.320828 -4.618179
H  -1.005202 0.273423 -4.322882
H  0.188544 2.428147 -2.845629
H  1.806007 1.732621 -3.129699
H  1.270867 2.124052 -1.471234
C  -0.361335 0.350611 2.490768
C  0.389553 -0.81543 2.659057
C  0.244528 1.398626 1.790207
C  1.682852 -0.932484 2.177487
H  -0.035822 -1.659885 3.191161
C  1.538394 1.308507 1.309296
H  -0.314865 2.310403 1.608547
C  2.294809 0.133547 1.489988
H  2.221117 -1.859162 2.330876
H  1.966105 2.151754 0.782459
N  3.558848 0.021292 0.988773
C  4.160124 1.004836 0.090503
C  4.364934 -1.188418 1.11394
H  3.438339 1.342895 -0.658018
H  4.506047 1.883706 0.648186
C  5.32628 0.244904 -0.542928
H  4.439604 -1.503177 2.157949
H  3.922742 -2.015073 0.54053
C  5.714093 -0.76993 0.534116
H  4.979937 -0.278901 -1.438533
H  6.145056 0.907094 -0.827206
H  6.313845 -0.284175 1.308918
H  6.27701 -1.618724 0.14363
elementType: C H Au P N
totalener: -1273.28234555575727 hartree
nucrepener: 2246.87522325927557 hartree
electener: -3520.07325123984083 hartree
oneelecener: -6232.71539426887193 hartree
twoeener: 2712.64214302903110 hartree
cpcmener: -0.07672011112224 hartree
kineticenergy: 1178.58805092747752 hartree
exchangeener: -100.724939100328 hartree
energy: -2098.8264 -392.6768 -281.5222 -281.0189 -280.9759 -280.7196 -280.3890 -280.3741 -280.1361 -280.0074 -279.8996 -279.8977 -279.8852 -279.8334 -279.8293 -279.7454 -279.5646 -279.5640 -279.5576 -279.5368 -279.3200 -182.5886 -132.3248 -132.3234 -132.2988 -117.2121 -67.9515 -67.5565 -67.4626 -29.9765 -27.4885 -26.8698 -25.9899 -25.5207 -25.2593 -24.4216 -24.2442 -23.6909 -23.1884 -23.1114 -23.0700 -21.6447 -20.8890 -20.3311 -19.2921 -19.2089 -18.9348 -18.7116 -18.3864 -17.8695 -17.0253 -16.9706 -16.4718 -15.9833 -15.9260 -15.8560 -15.4544 -15.4239 -15.3238 -14.9740 -14.8524 -14.7352 -14.6347 -14.5979 -14.5118 -14.4449 -14.3749 -14.0752 -13.9247 -13.7477 -13.4681 -13.4141 -13.2596 -13.0781 -12.8734 -12.5706 -12.4141 -12.3967 -12.2852 -12.2243 -12.1140 -12.0855 -11.9411 -11.9188 -11.4832 -11.1752 -10.9371 -10.3820 -9.9074 -9.7094 -7.6656 0.4320 1.0587 1.1778 1.2746 1.4611 1.6038 1.6871 1.9354 1.9783 2.0318 2.0495 electronvolt
chargesum: 1.0000000
charge: 0.370484 0.140806 0.095309 -0.502900 0.051081 0.087551 -0.130283 0.101490 0.058721 -0.279127 -0.106013 0.098957 0.126430 -0.107363 0.515188 -0.516387 -0.275227 -0.190374 0.140088 0.147577 0.055883 0.150085 0.158509 0.159319 0.151183 0.167555 0.061376 0.295521 -0.140019 -0.434382 -0.290055 0.010116 0.003908 -0.095661 0.895117 -0.008278 -0.009608 -0.048228 -0.065601 -0.176421 -0.216187 0.123289 0.088268 0.089547 0.124097 -0.307835 0.046995 0.118142 0.140114 0.127240
charge: -0.012587 0.012037 0.039292 -0.155828 0.108808 -0.040510 0.209283 -0.029793 -0.026908 -0.223675 0.012266 0.025958 0.026056 0.694255 0.763229 -0.014490 0.000493 0.015961 -0.033379 -0.027352 -0.078562 -0.042428 -0.033070 -0.042651 -0.038785 -0.028793 -0.068369 -0.194779 0.041896 0.019417 0.068327 0.017677 0.049099 0.013884 -0.215466 -0.000056 -0.003366 -0.033777 0.001183 -0.006173 0.009146 0.038102 0.022900 0.029935 0.033952 0.020773 0.016624 0.018219 0.023457 0.018570
qa: 0.3705 0.1408 0.0953 -0.5029 0.0511 0.0876 -0.1303 0.1015 0.0587 -0.2791 -0.1060 0.0990 0.1264 -0.1074 0.5152 -0.5164 -0.2752 -0.1904 0.1401 0.1476 0.0559 0.1501 0.1585 0.1593 0.1512 0.1676 0.0614 0.2955 -0.1400 -0.4344 -0.2901 0.0101 0.0039 -0.0957 0.8951 -0.0083 -0.0096 -0.0482 -0.0656 -0.1764 -0.2162 0.1233 0.0883 0.0895 0.1241 -0.3078 0.0470 0.1181 0.1401 0.1272
va: 3.8664 0.9525 1.0534 4.0418 3.6981 1.0359 3.7136 0.9613 1.0453 2.4488 4.0660 1.0417 0.9876 1.8480 3.8069 4.0520 3.9783 4.0265 1.0655 1.0381 1.6941 1.0734 1.0851 1.0643 1.0831 1.0552 1.1265 1.2672 2.6544 2.4722 3.0155 0.9353 3.2580 1.0842 1.6337 0.9251 0.8819 2.7370 4.4164 4.3035 1.2284 0.9330 3.8369 0.9918 0.9728 4.4192 1.0267 1.0316 0.9877 1.0217
dispersion: -0.140165537 hartree
energy: -1273.422511093172 hartree
dipole: 242.023541681 -241.870232764 0.153308917 1.348179242 -1.955714495 -0.607535253 127.027553397 -129.563912230 -2.536358833
dipolemethod: SCF
magnitude: 2.612607669 au
magnitude: 6.640720949 debye
