program: Orca
programVersion: 6.1.x
elementType: C H H C C H C H H C C H H Au P C C C H H H H H H H H H C C C C H C H C H H C F F F
elementType: Au
charge: 1
multiplicity: 1
keywords: wb97x-d3bj def2-TZVPPD def2/J defgrid3 verytightscf
formula: C16H20F3AuP
InChI: InChI=1/C13H11F3.C3H9P.Au/c1-3-4-6-10(2)11-7-5-8-12(9-11)13(14,15)16;1-4(2)3;/h1,5,7-9H,2,4,6H2;1-3H3;/rC16H20AuF3P/c1-12(8-9-15-11-17(15)21(2,3)4)13-6-5-7-14(10-13)16(18,19)20/h5-7,10-11H,1,8-9H2,2-4H3
41 atoms
C  -3.184915 -0.787875 -1.664177
H  -2.772394 -1.69967 -1.230579
H  -4.104155 -1.063291 -2.188153
C  -2.243271 -0.298167 -2.676144
C  -1.555519 0.11765 -3.593083
H  -1.139224 0.469251 -4.516829
C  -1.713634 1.912996 -0.296165
H  -0.810305 2.321828 0.140841
H  -2.146025 2.463914 -1.124526
C  -2.294892 0.793223 0.144805
C  -3.509683 0.263564 -0.581665
H  -4.213961 -0.192845 0.116368
H  -4.01892 1.099521 -1.062788
Au -0.070221 -0.038127 -1.91002
P  1.891545 -0.149125 -0.741945
C  3.326186 -0.405918 -1.810483
C  2.266796 1.336103 0.214113
C  1.902606 -1.522169 0.430988
H  1.807469 -2.460751 -0.118116
H  2.838287 -1.521604 0.994604
H  1.059637 -1.4256 1.115255
H  3.198328 -1.330382 -2.375883
H  4.231037 -0.470453 -1.201557
H  3.414549 0.428659 -2.508229
H  2.31942 2.194622 -0.457795
H  3.225281 1.211259 0.723103
H  1.483127 1.508379 0.951122
C  -1.738368 0.017753 1.29038
C  -2.098544 -1.311881 1.516269
C  -0.829559 0.607249 2.174628
C  -1.548371 -2.04043 2.565754
H  -2.820407 -1.801023 0.87584
C  -0.280434 -0.123231 3.214344
H  -0.560195 1.64849 2.062626
C  -0.627127 -1.455572 3.41852
H  -1.843336 -3.072818 2.714938
H  -0.190167 -2.020499 4.233516
C  0.764815 0.504768 4.094617
F  0.707288 1.850516 4.097612
F  2.016787 0.175819 3.686944
F  0.667384 0.103328 5.377848
elementType: C H Au P F
totalener: -1398.93958179874039 hartree
nucrepener: 2161.46053096784817 hartree
electener: -3560.31539593899333 hartree
oneelecener: -6246.59739440352678 hartree
twoeener: 2686.28199846453344 hartree
cpcmener: -0.08127449173894 hartree
kineticenergy: 1304.21105797057999 hartree
exchangeener: -105.624120070507 hartree
energy: -2098.8027 -675.1225 -675.0763 -675.0097 -286.8451 -281.5508 -281.0402 -280.8613 -280.7191 -280.5990 -280.5273 -280.3609 -280.3285 -280.2398 -280.1950 -280.1760 -279.9080 -279.8890 -279.8794 -279.8137 -182.5657 -132.3018 -132.3011 -132.2753 -117.1676 -67.9014 -67.5179 -67.4249 -39.7685 -37.3497 -37.2286 -28.1898 -27.1253 -26.2226 -25.5090 -25.3527 -24.8529 -24.0324 -23.1038 -23.0915 -23.0429 -21.9275 -21.0157 -20.8385 -19.7546 -19.7146 -19.3894 -18.9240 -18.7810 -18.0165 -17.5912 -16.8213 -16.6728 -16.4207 -16.4001 -16.1408 -15.8820 -15.7225 -15.6445 -15.5549 -15.3880 -15.2497 -15.2351 -15.0261 -14.7513 -14.5630 -14.5308 -14.4605 -14.4239 -14.2890 -14.0420 -13.8554 -13.5402 -13.3888 -13.1309 -13.0531 -12.6886 -12.5289 -12.4652 -12.2831 -12.2549 -12.0732 -11.6469 -11.3296 -10.9472 -10.2916 -10.1859 -9.1421 0.1798 0.5592 0.8669 1.1555 1.3592 1.5172 1.7084 1.9005 1.9805 2.1062 2.1243 electronvolt
chargesum: 1.0000000
charge: 0.408208 0.089571 0.071069 -0.519272 0.074271 0.071295 0.047398 0.088008 0.027714 -0.362351 -0.078600 0.075336 0.198080 -0.130858 0.673493 -0.532455 -0.174250 -0.159091 0.129082 0.145338 -0.016012 0.153897 0.160032 0.155092 0.120551 0.165447 -0.007647 1.198596 -0.393602 -0.231651 -0.511377 -0.044656 0.489869 -0.076301 -0.106948 0.031686 -0.066733 0.601170 -0.261096 -0.243655 -0.258651
charge: -0.007939 0.018129 0.042534 -0.147666 0.112807 -0.040477 0.190226 -0.035412 -0.013514 -0.216618 0.016057 0.028475 0.029421 0.688756 0.768007 -0.013203 0.008270 0.010623 -0.036842 -0.027981 -0.073019 -0.042861 -0.033074 -0.041840 -0.036237 -0.028990 -0.068839 -0.128063 0.072404 0.091351 0.048228 0.008057 -0.098819 0.013772 0.066411 0.017914 0.029489 -0.559663 0.133857 0.122393 0.133875
qa: 0.4082 0.0896 0.0711 -0.5193 0.0743 0.0713 0.0474 0.0880 0.0277 -0.3624 -0.0786 0.0753 0.1981 -0.1309 0.6735 -0.5325 -0.1742 -0.1591 0.1291 0.1453 -0.0160 0.1539 0.1600 0.1551 0.1206 0.1654 -0.0076 1.1986 -0.3936 -0.2317 -0.5114 -0.0447 0.4899 -0.0763 -0.1069 0.0317 -0.0667 0.6012 -0.2611 -0.2437 -0.2587
va: 4.0907 1.0369 1.0081 4.0235 3.4605 1.0213 3.8371 0.9328 1.0258 2.8785 3.6836 1.0549 0.9048 1.8366 3.8325 4.0271 3.9967 3.9624 1.0924 1.0700 1.3629 1.0682 1.0859 1.0627 1.0970 1.0530 1.2234 1.2965 3.1310 3.3674 3.5044 0.9939 2.1371 1.0147 3.2895 0.9983 1.0488 3.0764 0.9585 0.9922 0.9067
dispersion: -0.122448799 hartree
energy: -1399.062030597455 hartree
dipole: -9.487425425 9.202463170 -0.284962255 -0.727120336 -0.115310058 -0.842430394 258.617880875 -261.465908274 -2.848027398
dipolemethod: SCF
magnitude: 2.983647519 au
magnitude: 7.583829297 debye
