program: Orca
programVersion: 6.1.x
elementType: C H H C C H C H H C C H H Au P C C C H H H H H H H H H C C C C H C H C H H C C H
elementType: Au
charge: 1
multiplicity: 1
keywords: wb97x-d3bj def2-TZVPPD def2/J defgrid3 verytightscf
formula: C17H21AuP
InChI: InChI=1/C14H12.C3H9P.Au/c1-4-6-7-12(3)14-10-8-13(5-2)9-11-14;1-4(2)3;/h1-2,8-11H,3,6-7H2;1-3H3;/rC17H21AuP/c1-6-15-8-10-16(11-9-15)14(2)7-12-17-13-18(17)19(3,4)5/h1,8-11,13H,2,7,12H2,3-5H3
40 atoms
C  -0.45543 -1.299924 2.838057
H  0.182706 -1.794255 2.103679
H  -0.8034 -2.063371 3.538459
C  -1.641438 -0.752995 2.166058
C  -2.693317 -0.270796 1.778507
H  -3.69173 0.095349 1.637058
C  0.345906 2.141847 2.821168
H  0.699064 2.958054 2.20046
H  -0.391126 2.380146 3.581161
C  0.806424 0.898469 2.687274
C  0.311106 -0.201587 3.593724
H  1.143545 -0.680824 4.113457
H  -0.340731 0.229793 4.354704
Au -1.416267 -0.131848 -0.043725
P  -0.81327 0.14432 -2.233804
C  -2.200622 -0.238778 -3.327482
C  -0.31024 1.819997 -2.679104
C  0.522831 -0.954612 -2.750452
H  0.209456 -1.990014 -2.60579
H  0.748015 -0.784351 -3.805818
H  1.412478 -0.764086 -2.150435
H  -2.523783 -1.2675 -3.160313
H  -1.890992 -0.116717 -4.368124
H  -3.031591 0.435212 -3.112632
H  -1.123731 2.511047 -2.451473
H  -0.086087 1.859462 -3.747625
H  0.573215 2.109696 -2.111222
C  1.798258 0.545714 1.633128
C  2.714409 -0.492656 1.818403
C  1.833615 1.249188 0.425045
C  3.648138 -0.806608 0.84277
H  2.714813 -1.062879 2.73942
C  2.769316 0.949597 -0.549679
H  1.111163 2.035472 0.241389
C  3.686056 -0.085659 -0.351371
H  4.353356 -1.613622 1.005088
H  2.78548 1.505479 -1.47993
C  4.637918 -0.41941 -1.378309
C  5.42451 -0.704036 -2.240189
H  6.128429 -0.954641 -3.005208
elementType: C H Au P
totalener: -1137.91767575372137 hartree
nucrepener: 1712.93574057796422 hartree
electener: -2850.76806518847889 hartree
oneelecener: -4987.00054667620043 hartree
twoeener: 2136.23248148772154 hartree
cpcmener: -0.08163771461235 hartree
kineticenergy: 1043.92942089983558 hartree
exchangeener: -87.812301121469 hartree
energy: -2098.8514 -281.5814 -281.0820 -280.7973 -280.7712 -280.4364 -280.3348 -280.1698 -280.1684 -280.1262 -280.1179 -280.0553 -280.0550 -279.9249 -279.9247 -279.9090 -279.8160 -279.6177 -182.6145 -132.3506 -132.3492 -132.3245 -117.2840 -68.0217 -67.6243 -67.5368 -28.0058 -27.0811 -26.2211 -25.5450 -25.2043 -24.6077 -24.3756 -23.6319 -23.1264 -23.0888 -21.8169 -21.0328 -20.3856 -18.9614 -18.8552 -18.6598 -18.4811 -17.3559 -16.8755 -16.6354 -16.2028 -15.9661 -15.9215 -15.5561 -15.4526 -15.4385 -15.0119 -14.8855 -14.7138 -14.5443 -14.5059 -14.2275 -14.1637 -13.9684 -13.7054 -13.4512 -13.1435 -13.0610 -12.7029 -12.5998 -12.3652 -12.3392 -12.2823 -12.1672 -12.0198 -11.4604 -11.0339 -10.9777 -10.5998 -10.3894 -9.9893 -8.9523 0.1342 0.4264 0.9774 1.2348 1.4471 1.4937 1.6792 1.7876 2.0796 2.0865 2.1735 electronvolt
chargesum: 1.0000000
charge: 0.401132 0.125637 0.091920 -0.490741 0.036167 0.092350 -0.031534 0.096774 0.051984 -0.240898 -0.178464 0.106282 0.139465 -0.127311 0.734576 -0.518567 -0.305082 -0.205222 0.133597 0.166619 -0.024358 0.154498 0.160489 0.154352 0.123670 0.164421 0.090693 0.532349 0.217982 -0.175745 -0.595704 0.026914 -0.298804 0.009924 0.510056 0.024265 -0.051538 -0.362764 0.154975 0.105643
charge: -0.008916 0.021446 0.041098 -0.154717 0.104634 -0.039928 0.225444 -0.024206 -0.019195 -0.215191 0.011682 0.022768 0.028795 0.695025 0.756108 -0.014686 0.005608 0.008902 -0.037210 -0.027986 -0.067313 -0.042567 -0.032983 -0.042008 -0.036952 -0.028930 -0.066621 -0.153656 0.066723 0.031287 0.066887 0.017430 0.038884 0.001630 -0.227937 0.024303 0.020691 -0.086841 0.208042 -0.069545
qa: 0.4011 0.1256 0.0919 -0.4907 0.0362 0.0923 -0.0315 0.0968 0.0520 -0.2409 -0.1785 0.1063 0.1395 -0.1273 0.7346 -0.5186 -0.3051 -0.2052 0.1336 0.1666 -0.0244 0.1545 0.1605 0.1544 0.1237 0.1644 0.0907 0.5323 0.2180 -0.1757 -0.5957 0.0269 -0.2988 0.0099 0.5101 0.0243 -0.0515 -0.3628 0.1550 0.1056
va: 3.9127 0.9674 1.0236 4.0407 3.7407 1.0266 3.6846 0.9529 1.0424 2.5355 4.2141 1.0354 0.9737 1.8612 3.8390 4.0488 4.0177 3.9963 1.0968 1.0581 1.2370 1.0646 1.0827 1.0635 1.0987 1.0881 1.0776 1.4071 2.7127 2.7602 2.9159 0.8878 3.0558 0.9059 0.9415 1.0032 1.0122 2.9096 3.7510 1.0272
dispersion: -0.116963291 hartree
energy: -1138.034639044250 hartree
dipole: 208.927641552 -210.787881023 -1.860239471 21.942741372 -22.230274887 -0.287533514 3.536518311 -4.447871317 -0.911353006
dipolemethod: SCF
magnitude: 2.091346627 au
magnitude: 5.315780674 debye
