program: Orca
programVersion: 6.1.x
elementType: C H H C C H C H H C C H H Au P C C C H H H H H H H H H C C C C H C H C H O C H H H O C H H H
elementType: Au
charge: 1
multiplicity: 1
keywords: wb97x-d3bj def2-TZVPPD def2/J defgrid3 verytightscf
formula: C17H25AuO2P
InChI: InChI=1/C14H16O2.C3H9P.Au/c1-15-13-9-8-12(10-14(13)16-2)11-6-4-3-5-7-11;1-4(2)3;/h4,8-10H,5-7H2,1-2H3;1-3H3;/rC17H25AuO2P/c1-19-16-11-8-14(12-17(16)20-2)13-6-9-15(10-7-13)18-21(3,4)5/h8-9,11-12H,6-7,10H2,1-5H3
46 atoms
C  -0.11417 -1.34727 0.004885
H  0.879633 -1.018391 0.328575
H  0.042025 -2.239341 -0.606101
C  -0.777286 -0.258612 -0.803508
C  -1.771235 0.441572 -0.251325
H  -2.280444 1.231539 -0.797057
C  -2.283634 0.274424 1.182963
H  -2.463808 1.25429 1.61728
H  -3.245012 -0.256357 1.16116
C  -1.341566 -0.556491 1.971581
C  -0.951076 -1.780633 1.239337
H  -0.409321 -2.508156 1.836807
H  -1.867066 -2.245608 0.863223
Au -0.108097 0.098712 -2.722796
P  0.633601 0.492727 -4.873583
C  -0.602138 0.154922 -6.156834
C  1.146884 2.203672 -5.184753
C  2.068736 -0.503267 -5.359071
H  1.815997 -1.563004 -5.287834
H  2.365993 -0.268689 -6.384005
H  2.900648 -0.295964 -4.683102
H  -0.908946 -0.891267 -6.099059
H  -0.18845 0.358417 -7.147466
H  -1.478043 0.785596 -5.992318
H  0.306069 2.874633 -4.998175
H  1.481629 2.319166 -6.218428
H  1.961448 2.467604 -4.50742
C  -0.812747 -0.186025 3.210077
C  0.181624 -0.987439 3.858763
C  -1.247908 0.992731 3.867536
C  0.706181 -0.627508 5.064836
H  0.535929 -1.885306 3.378372
C  -0.740161 1.357603 5.088068
H  -2.00576 1.620566 3.421901
C  0.239699 0.566282 5.703722
H  -1.095611 2.255507 5.573188
O  0.791163 0.836276 6.868927
C  0.381157 2.022741 7.577251
H  -0.681318 1.96948 7.820463
H  0.973367 2.029255 8.489401
H  0.598365 2.911819 6.982872
O  1.653385 -1.303639 5.748397
C  2.150331 -2.502141 5.150349
H  2.895708 -2.891035 5.841846
H  1.348916 -3.235831 5.023518
H  2.619527 -2.290533 4.185021
elementType: C H Au P O
totalener: -1290.93015800528724 hartree
nucrepener: 1893.74661124826434 hartree
electener: -3184.59689060568417 hartree
oneelecener: -5558.47692505689338 hartree
twoeener: 2373.88003445120921 hartree
cpcmener: -0.07402464791029 hartree
kineticenergy: 1196.17123658634114 hartree
exchangeener: -100.114245321300 hartree
energy: -2098.1669 -525.0143 -524.2956 -282.9205 -282.2042 -282.0719 -281.2952 -281.0530 -280.9804 -280.7803 -280.6151 -280.4177 -280.1537 -280.0854 -279.8637 -279.6296 -279.6261 -279.6240 -279.5226 -279.3281 -181.9442 -131.6852 -131.6844 -131.6367 -116.2099 -66.8777 -66.4996 -66.4957 -34.2055 -33.1909 -28.4287 -27.3292 -25.5566 -25.1985 -25.1190 -24.4437 -24.1486 -23.2676 -23.0056 -22.7785 -22.7742 -21.2480 -20.9113 -20.3098 -19.3749 -18.7528 -18.5352 -17.9848 -17.7822 -17.0704 -17.0359 -16.7964 -16.2116 -16.1559 -15.8036 -15.6685 -15.4769 -15.2202 -15.0750 -15.0707 -14.9655 -14.7255 -14.4670 -14.3907 -14.2355 -14.2247 -14.1422 -13.9185 -13.7393 -13.6128 -13.4644 -12.9932 -12.7903 -12.6442 -12.5699 -12.5240 -12.5102 -12.4943 -11.9731 -11.5887 -11.1574 -11.1390 -11.0952 -10.3973 -9.8368 -9.4799 -9.1978 -8.8778 -1.6827 1.0572 1.1956 1.2538 1.4078 1.5328 1.6128 1.6825 1.9760 2.0896 2.1732 electronvolt
chargesum: 1.0000000
charge: 0.155410 0.121654 0.053522 -0.149130 -0.268226 0.012507 0.428836 0.063185 0.107134 0.603135 0.121659 -0.017300 0.174420 -0.466577 0.310723 -0.427004 -0.427998 -0.423186 0.136349 0.163017 0.135235 0.133425 0.164248 0.137402 0.138429 0.163868 0.131992 -0.333246 -0.239015 -0.561169 0.686592 -0.130462 -0.175274 -0.052681 0.982426 -0.002731 -0.275907 -0.332222 0.186261 0.048833 0.185956 -0.349457 -0.289824 0.044861 0.168831 0.161499
charge: -0.064124 0.017019 0.002149 -0.359594 -0.077500 -0.027558 0.033909 0.007544 0.052935 0.002886 0.051408 0.015055 0.050937 0.551119 0.711686 -0.029303 -0.029158 -0.028824 -0.047878 -0.039236 -0.047998 -0.048038 -0.039258 -0.047817 -0.047838 -0.039246 -0.048003 -0.105433 0.158612 0.127751 -0.172020 0.004984 0.118225 0.022338 -0.145446 0.019844 0.034619 0.193048 0.022666 0.020072 0.022596 -0.011863 0.156710 0.017104 0.020571 0.020349
qa: 0.1554 0.1217 0.0535 -0.1491 -0.2682 0.0125 0.4288 0.0632 0.1071 0.6031 0.1217 -0.0173 0.1744 -0.4666 0.3107 -0.4270 -0.4280 -0.4232 0.1363 0.1630 0.1352 0.1334 0.1642 0.1374 0.1384 0.1639 0.1320 -0.3332 -0.2390 -0.5612 0.6866 -0.1305 -0.1753 -0.0527 0.9824 -0.0027 -0.2759 -0.3322 0.1863 0.0488 0.1860 -0.3495 -0.2898 0.0449 0.1688 0.1615
va: 3.7311 1.0429 1.0966 2.4647 3.2447 1.0400 3.8064 0.9906 0.9452 2.5517 4.0134 1.1042 0.8893 1.6309 3.6685 4.0651 4.0565 4.0272 1.0871 1.0835 1.0889 1.0930 1.0819 1.0851 1.0836 1.0831 1.0944 1.3161 2.5304 3.0797 2.5206 1.0966 2.9397 0.9933 1.8899 0.9881 1.7427 3.9320 0.9807 1.0766 0.9837 1.5848 3.9359 1.0610 0.9965 1.0015
dispersion: -0.116184659 hartree
energy: -1291.046342664134 hartree
dipole: 18.579831887 -18.766214599 -0.186382712 -9.880085616 10.215364594 0.335278977 373.040501526 -369.979815599 3.060685927
dipolemethod: SCF
magnitude: 3.084631072 au
magnitude: 7.840509090 debye
