program: Orca
programVersion: 6.1.x
elementType: C H H C C H C H H C C H H Au P C C C H H H H H H H H H C C C C H C H C H H N C C H H H H H H
elementType: Au
charge: 1
multiplicity: 1
keywords: wb97x-d3bj def2-TZVPPD def2/J defgrid3 verytightscf
formula: C17H26AuNP
InChI: InChI=1/C14H17N.C3H9P.Au/c1-15(2)14-10-8-13(9-11-14)12-6-4-3-5-7-12;1-4(2)3;/h4,8-11H,5-7H2,1-2H3;1-3H3;/rC17H26AuNP/c1-19(2)17-12-8-15(9-13-17)14-6-10-16(11-7-14)18-20(3,4)5/h8-10,12-13H,6-7,11H2,1-5H3
46 atoms
C  -1.060023 -1.179284 0.234765
H  -0.060228 -1.535271 0.509911
H  -1.497714 -1.961465 -0.39073
C  -0.942079 0.11071 -0.54586
C  -1.275842 1.258603 0.05282
H  -1.213711 2.205502 -0.478254
C  -1.72561 1.402431 1.503627
H  -1.240076 2.269155 1.946712
H  -2.806676 1.597693 1.531771
C  -1.486061 0.145473 2.269589
C  -1.933802 -1.048724 1.502854
H  -1.918825 -1.972874 2.074306
H  -2.963178 -0.860874 1.180308
Au -0.2587 0.039071 -2.491114
P  0.501754 -0.039527 -4.670742
C  -0.74904 0.392324 -5.910908
C  1.883604 1.081602 -5.020415
C  1.104023 -1.66851 -5.192267
H  0.29977 -2.400829 -5.097819
H  1.444462 -1.634425 -6.229983
H  1.931505 -1.973129 -4.548423
H  -1.591116 -0.298257 -5.832619
H  -0.32496 0.33595 -6.916337
H  -1.11015 1.405801 -5.725252
H  1.576596 2.109626 -4.817965
H  2.191885 0.99339 -6.064971
H  2.725553 0.833966 -4.370942
C  -0.871431 0.093418 3.501198
C  -0.631869 -1.153768 4.179727
C  -0.432781 1.278382 4.191829
C  -0.029737 -1.219664 5.389615
H  -0.936711 -2.080869 3.71446
C  0.164506 1.23368 5.405123
H  -0.584792 2.248429 3.738858
C  0.394397 -0.02317 6.063246
H  0.128378 -2.182862 5.852393
H  0.469648 2.154371 5.880781
N  0.974906 -0.076629 7.251206
C  1.202208 -1.360574 7.919312
C  1.402426 1.147211 7.933769
H  1.680781 -1.174504 8.876621
H  0.255605 -1.875629 8.094161
H  1.854631 -1.996775 7.318049
H  1.860188 0.876261 8.880961
H  2.135643 1.686596 7.331147
H  0.546992 1.796898 8.129346
elementType: C H Au P N
totalener: -1195.82507151192067 hartree
nucrepener: 1731.16328705018282 hartree
electener: -2926.90762620998521 hartree
oneelecener: -5103.34643556735136 hartree
twoeener: 2176.43880935736615 hartree
cpcmener: -0.07218984689936 hartree
kineticenergy: 1101.36442718650869 hartree
exchangeener: -93.291288374425 hartree
energy: -2098.1240 -394.2687 -282.2467 -281.5870 -280.7185 -280.7175 -280.6982 -280.6961 -280.4442 -280.2156 -280.2149 -279.9370 -279.8608 -279.6441 -279.6013 -279.5986 -279.5959 -279.3439 -279.1951 -181.9014 -131.6428 -131.6419 -131.5934 -116.1463 -66.8115 -66.4356 -66.4317 -30.9663 -28.0893 -26.9996 -25.2261 -25.1589 -25.0844 -24.2032 -23.8523 -23.8165 -22.7488 -22.7453 -22.4395 -20.9744 -20.4294 -20.1546 -19.2101 -18.5102 -18.3786 -17.5609 -17.1846 -16.7219 -16.5859 -16.1556 -15.6339 -15.5170 -15.4154 -15.2366 -15.0881 -15.0418 -15.0371 -14.5975 -14.5845 -14.3226 -14.2718 -14.1975 -14.1811 -14.0857 -13.8097 -13.7754 -13.7117 -13.5090 -13.2483 -12.7734 -12.5618 -12.4742 -12.4105 -11.8933 -11.6906 -11.5138 -11.0886 -11.0751 -11.0113 -10.6752 -9.7904 -9.3566 -9.0531 -8.6494 -1.2618 1.1046 1.2255 1.2561 1.3587 1.5786 1.7259 1.9011 2.1593 2.2802 2.2980 electronvolt
chargesum: 1.0000000
charge: 0.150882 0.109806 0.050342 -0.165351 -0.250610 0.010587 0.346960 0.052305 0.109806 0.542329 0.088352 0.025983 0.159559 -0.466437 0.316522 -0.427335 -0.428450 -0.424624 0.136181 0.162747 0.134875 0.133305 0.163546 0.136778 0.136573 0.163967 0.132246 0.076534 -0.504607 -0.597213 -0.207554 -0.055426 -0.147449 -0.055882 1.114906 0.026671 0.030909 0.072660 -0.314882 -0.317291 0.092097 0.148642 0.148376 0.091194 0.146322 0.151151
charge: -0.077197 0.014779 -0.001250 -0.363231 -0.087765 -0.030661 0.023405 0.004493 0.048133 -0.031699 0.037910 0.007840 0.047142 0.546914 0.710976 -0.029931 -0.029842 -0.029505 -0.048088 -0.039562 -0.048174 -0.048212 -0.039614 -0.048070 -0.048012 -0.039602 -0.048315 -0.121672 0.108584 0.108272 0.100816 0.018349 0.100918 0.017760 -0.143992 0.006156 0.006321 -0.030851 0.195050 0.195097 0.006532 0.018223 0.018372 0.006570 0.017930 0.018703
qa: 0.1509 0.1098 0.0503 -0.1654 -0.2506 0.0106 0.3470 0.0523 0.1098 0.5423 0.0884 0.0260 0.1596 -0.4664 0.3165 -0.4273 -0.4285 -0.4246 0.1362 0.1627 0.1349 0.1333 0.1635 0.1368 0.1366 0.1640 0.1322 0.0765 -0.5046 -0.5972 -0.2076 -0.0554 -0.1474 -0.0559 1.1149 0.0267 0.0309 0.0727 -0.3149 -0.3173 0.0921 0.1486 0.1484 0.0912 0.1463 0.1512
va: 3.7059 1.0530 1.1043 2.4702 3.2446 1.0386 3.9075 1.0005 0.9455 2.7031 4.1120 1.0408 0.9156 1.6260 3.6609 4.0665 4.0543 4.0293 1.0869 1.0838 1.0898 1.0932 1.0824 1.0859 1.0843 1.0830 1.0941 1.4025 2.6461 2.7642 2.7632 0.9737 2.7419 0.9950 2.0520 0.9560 0.9500 3.1895 3.9883 3.9845 0.9946 1.0047 1.0041 0.9963 1.0052 1.0053
dispersion: -0.117296101 hartree
energy: -1195.942367613156 hartree
dipole: 19.943755838 -18.772917341 1.170838496 -4.536768630 4.206714006 -0.330054624 372.393786412 -366.419794058 5.973992354
dipolemethod: SCF
magnitude: 6.096587856 au
magnitude: 15.496294818 debye
