program: Orca
programVersion: 6.1.x
elementType: C H H C C H C H H C C H H Au P C C C H H H H H H H H H C C C C H C H C H N C C H H H H H H F
elementType: Au
charge: 1
multiplicity: 1
keywords: wb97x-d3bj def2-TZVPPD def2/J defgrid3 verytightscf
formula: C17H25FAuNP
InChI: InChI=1/C14H16FN.C3H9P.Au/c1-16(2)14-9-8-12(10-13(14)15)11-6-4-3-5-7-11;1-4(2)3;/h4,8-10H,5-7H2,1-2H3;1-3H3;/rC17H25AuFNP/c1-20(2)17-11-8-14(12-16(17)19)13-6-9-15(10-7-13)18-21(3,4)5/h8-9,11-12H,6-7,10H2,1-5H3
46 atoms
C  -0.416778 -1.440908 0.035258
H  0.624235 -1.326849 0.35934
H  -0.445081 -2.342586 -0.581679
C  -0.831042 -0.235388 -0.777938
C  -1.658022 0.659861 -0.228862
H  -1.986599 1.534859 -0.784494
C  -2.193465 0.61007 1.200213
H  -2.156103 1.607015 1.63349
H  -3.250583 0.31112 1.182955
C  -1.461594 -0.406619 2.006458
C  -1.32164 -1.687439 1.26579
H  -0.935191 -2.50723 1.865376
H  -2.314636 -1.964856 0.898153
Au -0.085515 -0.017497 -2.689554
P  0.749397 0.235586 -4.828174
C  -0.180971 -0.655503 -6.104296
C  0.781705 1.951167 -5.414878
C  2.456563 -0.339925 -5.035204
H  2.514787 -1.401628 -4.787362
H  2.78727 -0.188621 -6.06555
H  3.111054 0.213126 -4.358611
H  -0.176737 -1.723521 -5.877793
H  0.266261 -0.490414 -7.087486
H  -1.214648 -0.304108 -6.111609
H  -0.232291 2.355917 -5.409387
H  1.187077 1.999852 -6.428358
H  1.401382 2.552129 -4.746427
C  -0.913261 -0.163827 3.247823
C  -0.192577 -1.177457 3.968593
C  -1.031025 1.105374 3.907307
C  0.365805 -0.925696 5.165779
H  -0.096617 -2.182919 3.582169
C  -0.480017 1.348939 5.120375
H  -1.568401 1.911675 3.42848
C  0.290954 0.35759 5.81835
H  -0.581674 2.332015 5.554999
N  0.864383 0.632318 6.977478
C  1.899087 -0.196758 7.611234
C  0.556991 1.879219 7.685135
H  2.530024 0.467963 8.199016
H  1.450797 -0.940912 8.271828
H  2.517009 -0.683127 6.863328
H  0.827772 1.744516 8.730186
H  1.130644 2.712407 7.271007
H  -0.507754 2.099356 7.631653
F  0.966026 -1.951111 5.815079
elementType: C H Au P N F
totalener: -1295.09661249790088 hartree
nucrepener: 1882.89579363633152 hartree
electener: -3177.91151933530500 hartree
oneelecener: -5543.74813442483992 hartree
twoeener: 2365.83661508953492 hartree
cpcmener: -0.07298698848466 hartree
kineticenergy: 1200.34803080069514 hartree
exchangeener: -100.280833128838 hartree
energy: -2098.1326 -674.7728 -394.4786 -282.6758 -282.6379 -281.6917 -280.8357 -280.8049 -280.7637 -280.7134 -280.6334 -280.3867 -279.9861 -279.9125 -279.6875 -279.6073 -279.6040 -279.6016 -279.3782 -279.2234 -181.9101 -131.6513 -131.6506 -131.6021 -116.1583 -66.8241 -66.4478 -66.4437 -37.6392 -31.0994 -28.2940 -27.1523 -25.4221 -25.2150 -25.0936 -24.2350 -24.0239 -23.8970 -22.7548 -22.7515 -22.5850 -21.1872 -20.8604 -20.3577 -19.6499 -18.5744 -18.4795 -17.9546 -17.7600 -17.2234 -17.1905 -16.6779 -16.3377 -16.0393 -15.9345 -15.6558 -15.4359 -15.2105 -15.1309 -15.0474 -15.0461 -14.6192 -14.5719 -14.3657 -14.3356 -14.2043 -14.1959 -14.0454 -13.9623 -13.7456 -13.7173 -13.4166 -13.2751 -13.1198 -12.6202 -12.4866 -12.4575 -12.0619 -11.8284 -11.5239 -11.1039 -11.0913 -11.0327 -10.6099 -9.8003 -9.3780 -9.0813 -8.6602 -1.4273 1.0929 1.2109 1.2574 1.3523 1.5712 1.7150 1.7762 2.1282 2.2276 2.2741 electronvolt
chargesum: 1.0000000
charge: 0.156716 0.111249 0.047094 -0.116397 -0.310957 0.005289 0.385565 0.049906 0.111250 0.531534 0.095968 -0.003896 0.165116 -0.468784 0.324550 -0.424196 -0.428126 -0.431365 0.137460 0.163963 0.133365 0.135039 0.163851 0.133003 0.137912 0.162318 0.133510 0.191791 -0.298289 -0.780527 0.481828 -0.086216 0.032492 -0.061719 0.432244 0.029293 0.177082 -0.316072 -0.418798 0.165987 0.131765 0.087265 0.153761 0.170101 0.129774 -0.322696
charge: -0.074581 0.015241 -0.000535 -0.362262 -0.086142 -0.030047 0.025534 0.005468 0.048546 -0.028727 0.041248 0.010134 0.047451 0.547449 0.711160 -0.029850 -0.029354 -0.029620 -0.048080 -0.039510 -0.048245 -0.048128 -0.039500 -0.048075 -0.047887 -0.039536 -0.048237 -0.116541 0.161280 0.112803 -0.152931 0.032653 0.106916 0.020373 -0.089367 0.009283 -0.017797 0.205074 0.195824 0.014053 0.022067 0.006029 0.014547 0.027378 0.011214 0.063228
qa: 0.1567 0.1112 0.0471 -0.1164 -0.3110 0.0053 0.3856 0.0499 0.1113 0.5315 0.0960 -0.0039 0.1651 -0.4688 0.3246 -0.4242 -0.4281 -0.4314 0.1375 0.1640 0.1334 0.1350 0.1639 0.1330 0.1379 0.1623 0.1335 0.1918 -0.2983 -0.7805 0.4818 -0.0862 0.0325 -0.0617 0.4322 0.0293 0.1771 -0.3161 -0.4188 0.1660 0.1318 0.0873 0.1538 0.1701 0.1298 -0.3227
va: 3.6808 1.0551 1.1077 2.4908 3.3780 1.0465 3.7829 0.9932 0.9430 2.5111 4.1177 1.0535 0.9091 1.6296 3.6528 4.0638 4.0398 4.0486 1.0855 1.0825 1.0931 1.0894 1.0817 1.0936 1.0829 1.0848 1.0915 1.0341 2.7762 2.9056 1.6378 0.9617 2.8082 1.0032 3.2137 0.9736 3.2248 3.9169 4.0081 0.9710 1.0721 1.0322 0.9854 1.0346 1.0091 0.9284
dispersion: -0.117751396 hartree
energy: -1295.214363893551 hartree
dipole: 13.166342008 -12.438313867 0.728028141 6.948979659 -5.790218044 1.158761615 387.723513656 -382.634673858 5.088839798
dipolemethod: SCF
magnitude: 5.269634137 au
magnitude: 13.394345511 debye
