program: Orca
programVersion: 6.1.x
elementType: C H H C C H C H H C C H H Au P C C C H H H H H H H H H C C C C H C H C H C H O H
elementType: Au
charge: 1
multiplicity: 1
keywords: wb97x-d3bj def2-TZVPPD def2/J defgrid3 verytightscf
formula: C16H21AuOP
InChI: InChI=1/C13H12O.C3H9P.Au/c14-9-10-3-1-4-11(7-10)13-6-2-5-12(13)8-13;1-4(2)3;/h1,3-4,7,9,12H,2,6,8H2;1-3H3;/rC16H21AuOP/c1-19(2,3)17-15-7-8-16(10-14(15)16)13-6-4-5-12(9-13)11-18/h4-6,9,11,14H,7-8,10H2,1-3H3
40 atoms
C  -2.14923 -0.737506 0.291381
H  -2.261639 -1.649507 -0.296791
H  -2.994965 -0.096501 0.001131
C  -0.91373 -0.001976 -0.097111
C  -0.342805 0.604905 1.030635
H  0.66664 0.989505 1.052079
C  -1.364733 1.389033 1.93422
H  -0.868432 2.202847 2.447203
H  -2.320038 1.62252 1.481747
C  -1.064505 0.026735 2.322748
C  -2.060379 -0.999314 1.802795
H  -1.683756 -2.007098 1.983901
H  -3.021251 -0.897297 2.310941
Au -0.152945 0.063971 -1.981967
P  0.709993 0.148844 -4.132826
C  -0.133301 1.350099 -5.191865
C  2.459482 0.606847 -4.194101
C  0.599898 -1.425455 -5.018379
H  -0.445882 -1.73025 -5.0888
H  1.017843 -1.320848 -6.022333
H  1.15423 -2.190092 -4.471023
H  -1.191307 1.091763 -5.264698
H  0.312588 1.346567 -6.1892
H  -0.042203 2.346587 -4.755771
H  2.593751 1.590544 -3.740395
H  2.804391 0.633103 -5.230323
H  3.046355 -0.123134 -3.633508
C  -0.221174 -0.283082 3.51298
C  0.616771 -1.398094 3.500016
C  -0.266774 0.509979 4.654387
C  1.400654 -1.714597 4.603785
H  0.662716 -2.01961 2.611453
C  0.515591 0.194234 5.762503
H  -0.918822 1.377168 4.692798
C  1.352893 -0.91927 5.738864
H  2.050393 -2.582015 4.572963
C  0.436013 1.063665 6.960758
H  1.95711 -1.150587 6.60875
O  1.070996 0.886765 7.977181
H  -0.262671 1.916827 6.872757
elementType: C H Au P O
totalener: -1175.12997408259776 hartree
nucrepener: 1604.86233566008968 hartree
electener: -2779.90293862002682 hartree
oneelecener: -4823.85110986244126 hartree
twoeener: 2043.94817124241445 hartree
cpcmener: -0.08205973506979 hartree
kineticenergy: 1080.92021959607155 hartree
exchangeener: -90.116468330019 hartree
energy: -2098.4974 -523.1114 -282.2489 -281.8874 -281.2819 -280.9029 -280.7760 -280.5361 -280.3154 -280.2644 -280.2466 -280.2306 -280.1985 -280.0941 -280.0898 -279.8340 -279.8257 -279.8241 -182.2800 -132.0182 -132.0181 -131.9778 -116.9538 -67.6573 -67.2553 -67.1912 -32.4290 -29.3402 -27.7991 -25.6208 -25.3662 -25.0561 -24.7398 -23.6726 -22.9903 -22.9867 -21.7069 -21.4870 -20.5982 -19.8083 -18.9660 -18.7722 -18.5900 -17.9336 -16.9681 -16.8067 -16.3188 -16.0822 -15.7988 -15.3469 -15.2829 -15.2791 -15.1312 -15.0987 -14.8696 -14.6830 -14.4459 -14.4337 -14.3464 -14.1685 -13.9343 -13.7046 -13.5873 -13.3265 -13.0486 -12.8869 -12.7652 -12.5952 -12.2179 -12.0326 -11.8295 -11.8102 -11.6826 -11.4494 -10.3938 -10.3160 -10.2835 -10.1176 -9.6815 -1.0277 -0.0292 0.9741 1.1884 1.2822 1.4563 1.4911 1.7124 1.8452 2.0969 2.2509 electronvolt
chargesum: 1.0000000
charge: 0.182427 0.127139 0.131861 0.212314 0.306294 0.025920 -0.119258 0.129148 0.032676 1.427007 -0.355741 0.152547 0.050263 -0.646460 0.229107 -0.423143 -0.422239 -0.423646 0.139690 0.164147 0.136950 0.138608 0.163783 0.137152 0.138911 0.164817 0.137651 -0.150391 -0.278746 -0.161326 -0.294600 0.107887 0.240083 0.037674 -0.203437 0.083747 0.080697 0.026141 -0.472411 0.046759
charge: -0.019964 0.020314 0.043951 -0.147052 -0.068306 0.036022 0.185256 0.036671 0.038946 -0.252127 0.071264 0.027743 0.039629 0.620627 0.725180 -0.021375 -0.021631 -0.021633 -0.045104 -0.036037 -0.045126 -0.045120 -0.035976 -0.045093 -0.045092 -0.036095 -0.045078 -0.108566 0.078635 0.108106 0.044299 0.030354 -0.142458 0.031788 0.069444 0.014876 -0.146790 0.020263 0.044228 0.041027
qa: 0.1824 0.1271 0.1319 0.2123 0.3063 0.0259 -0.1193 0.1291 0.0327 1.4270 -0.3557 0.1525 0.0503 -0.6465 0.2291 -0.4231 -0.4222 -0.4236 0.1397 0.1641 0.1370 0.1386 0.1638 0.1372 0.1389 0.1648 0.1377 -0.1504 -0.2787 -0.1613 -0.2946 0.1079 0.2401 0.0377 -0.2034 0.0837 0.0807 0.0261 -0.4724 0.0468
va: 3.8857 1.0251 0.9753 2.6815 3.3897 0.9878 4.1650 0.9641 1.0568 0.9144 4.4651 0.9352 0.9971 1.4138 3.6755 4.0736 4.0412 4.0484 1.0812 1.0811 1.0885 1.0855 1.0798 1.0878 1.0819 1.0794 1.0863 -0.0476 3.3541 3.1539 3.2634 0.9366 2.1835 0.9448 3.1843 0.9485 3.5012 0.9725 1.8904 1.0380
dispersion: -0.107055601 hartree
energy: -1175.237029683586 hartree
dipole: 21.311070212 -22.359840223 -1.048770011 -7.481004231 7.589563606 0.108559374 271.866492728 -275.856690685 -3.990197958
dipolemethod: SCF
magnitude: 4.127151974 au
magnitude: 10.490386633 debye
