program: Orca
programVersion: 6.1.x
elementType: C H H C C H C H H C C H H Au P C C C H H H H H H H H H C C C C H C H C H O O H H
elementType: Au
charge: 1
multiplicity: 1
keywords: wb97x-d3bj def2-TZVPPD def2/J defgrid3 verytightscf
formula: C15H21AuO2P
InChI: InChI=1/C12H12O2.C3H9P.Au/c13-10-4-3-8(6-11(10)14)12-5-1-2-9(12)7-12;1-4(2)3;/h3-4,6,9,13-14H,1,5,7H2;1-3H3;/rC15H21AuO2P/c1-19(2,3)16-12-6-7-15(9-11(12)15)10-4-5-13(17)14(18)8-10/h4-5,8,11,17-18H,6-7,9H2,1-3H3
40 atoms
C  2.007913 1.196584 0.248446
H  1.866073 2.121124 -0.312057
H  2.989422 0.807985 -0.061864
C  1.005515 0.163845 -0.142423
C  0.682527 -0.637342 0.955928
H  -0.17595 -1.292994 0.981351
C  1.892333 -1.102273 1.843369
H  1.657922 -2.035203 2.33989
H  2.868046 -1.04431 1.377102
C  1.226908 0.10583 2.274348
C  1.875818 1.384918 1.766984
H  1.229691 2.237607 1.979183
H  2.834343 1.551245 2.263178
Au 0.182122 0.0036 -1.996634
P  -0.748494 -0.184131 -4.11182
C  -0.012185 -1.50905 -5.101244
C  -2.523184 -0.538721 -4.089128
C  -0.576701 1.310501 -5.117745
H  0.482069 1.546778 -5.239322
H  -1.031001 1.157329 -6.099424
H  -1.068488 2.145361 -4.615024
H  1.056179 -1.321224 -5.222924
H  -0.489092 -1.552006 -6.083195
H  -0.146676 -2.463441 -4.588842
H  -2.699401 -1.477018 -3.559916
H  -2.902727 -0.619071 -5.110407
H  -3.047774 0.264117 -3.567797
C  0.337531 0.133143 3.468447
C  -0.760258 0.988673 3.5038
C  0.599853 -0.682291 4.570105
C  -1.589413 1.0281 4.616902
H  -0.980571 1.621574 2.651053
C  -0.223823 -0.641488 5.682381
H  1.457391 -1.347883 4.571052
C  -1.327587 0.216315 5.710496
H  -2.45029 1.686806 4.648615
O  -0.0333 -1.404568 6.802517
O  -2.146031 0.2657 6.79632
H  0.761885 -1.945099 6.699643
H  -1.821141 -0.358711 7.461137
elementType: C H Au P O
totalener: -1212.27413358506783 hartree
nucrepener: 1653.51900697786436 hartree
electener: -2865.70844282842882 hartree
oneelecener: -4974.46288594351972 hartree
twoeener: 2108.75444311509091 hartree
cpcmener: -0.07782681423265 hartree
kineticenergy: 1117.93199732908852 hartree
exchangeener: -92.403348481797 hartree
energy: -2098.4722 -524.2086 -523.9994 -281.7505 -281.6431 -281.5934 -281.2876 -280.8289 -280.7117 -280.2870 -280.1667 -280.0516 -280.0398 -279.9058 -279.8836 -279.8157 -279.8091 -279.8055 -182.2544 -131.9929 -131.9926 -131.9519 -116.9031 -67.6051 -67.2042 -67.1428 -33.2980 -32.5055 -29.2294 -27.4189 -25.4764 -25.3418 -24.6038 -24.3080 -23.5244 -22.9717 -22.9679 -21.6345 -21.0424 -20.6764 -19.0594 -18.9042 -18.6890 -18.5521 -18.3007 -17.2874 -16.7118 -16.3165 -16.0096 -15.5379 -15.5193 -15.2637 -15.2596 -15.1755 -14.7745 -14.6728 -14.4557 -14.4134 -14.3919 -14.2970 -14.0787 -13.9164 -13.6442 -13.6166 -13.5346 -13.0536 -12.8517 -12.7733 -12.7171 -12.3776 -12.1491 -12.0009 -11.7741 -11.7576 -11.6502 -11.1791 -10.2759 -10.1673 -9.6104 -8.6514 -0.9558 0.9993 1.1473 1.2830 1.4176 1.5117 1.6313 1.7308 1.8172 2.1073 2.1586 electronvolt
chargesum: 1.0000000
charge: 0.190464 0.130712 0.133059 0.172800 0.306766 0.016879 -0.121595 0.128089 0.035541 1.415618 -0.387125 0.139504 0.052483 -0.617831 0.235295 -0.423939 -0.426175 -0.423298 0.138688 0.166406 0.137218 0.136533 0.164640 0.139095 0.139886 0.164290 0.136907 -0.325878 -0.503704 -0.278401 -0.379169 0.084229 0.650979 -0.037104 0.320839 0.038753 -0.434841 -0.413189 0.186816 0.209760
charge: -0.022351 0.017378 0.042918 -0.155515 -0.066843 0.033703 0.176672 0.035170 0.039158 -0.242770 0.067903 0.025935 0.039609 0.617261 0.724648 -0.021881 -0.021845 -0.022057 -0.045295 -0.036300 -0.045262 -0.045252 -0.036209 -0.045289 -0.045246 -0.036219 -0.045222 -0.132395 0.054637 0.123623 0.082893 0.024757 -0.196015 0.035157 -0.213914 0.025468 0.287509 0.293776 -0.124631 -0.147665
qa: 0.1905 0.1307 0.1331 0.1728 0.3068 0.0169 -0.1216 0.1281 0.0355 1.4156 -0.3871 0.1395 0.0525 -0.6178 0.2353 -0.4239 -0.4262 -0.4233 0.1387 0.1664 0.1372 0.1365 0.1646 0.1391 0.1399 0.1643 0.1369 -0.3259 -0.5037 -0.2784 -0.3792 0.0842 0.6510 -0.0371 0.3208 0.0388 -0.4348 -0.4132 0.1868 0.2098
va: 3.8782 1.0196 0.9724 2.7467 3.3705 0.9968 4.1922 0.9628 1.0457 0.7668 4.4625 0.9460 1.0014 1.4274 3.6802 4.0709 4.0578 4.0319 1.0835 1.0808 1.0880 1.0887 1.0787 1.0847 1.0803 1.0792 1.0876 0.4724 3.6215 3.3251 3.4419 0.9572 2.5306 1.0009 3.3917 1.0035 1.8733 1.8933 1.0018 0.9939
dispersion: -0.105536231 hartree
energy: -1212.379669815871 hartree
dipole: -23.583893347 25.063851527 1.479958181 -2.543678424 1.661525838 -0.882152586 274.588106085 -276.880430828 -2.292324743
dipolemethod: SCF
magnitude: 2.867616105 au
magnitude: 7.288900882 debye
