program: Orca
programVersion: 6.1.x
elementType: C H H C C H C H H C C H H Au P C C C H H H H H H H H H C C C C H C H C H H N C C H H H H H H
elementType: Au
charge: 1
multiplicity: 1
keywords: wb97x-d3bj def2-TZVPPD def2/J defgrid3 verytightscf
formula: C17H26AuNP
InChI: InChI=1/C14H17N.C3H9P.Au/c1-15(2)13-7-5-11(6-8-13)14-9-3-4-12(14)10-14;1-4(2)3;/h5-8,12H,3,9-10H2,1-2H3;1-3H3;/rC17H26AuNP/c1-19(2)14-8-6-13(7-9-14)17-11-10-16(15(17)12-17)18-20(3,4)5/h6-9,15H,10-12H2,1-5H3
46 atoms
C  -0.177203 2.545096 -0.21871
H  -1.119264 2.675363 -0.750553
H  0.499521 3.325152 -0.597067
C  0.463088 1.229058 -0.529437
C  1.245119 0.795008 0.530803
H  1.615427 -0.216159 0.622211
C  2.029392 1.862962 1.362274
H  2.866274 1.40387 1.872555
H  2.24299 2.78597 0.836427
C  0.698776 1.625054 1.857304
C  -0.346876 2.580632 1.306037
H  -1.346533 2.23688 1.572612
H  -0.204985 3.575997 1.73362
Au 0.125543 0.168682 -2.237849
P  -0.264167 -1.033241 -4.179881
C  0.507625 -0.303286 -5.645628
C  0.353133 -2.73373 -4.119701
C  -2.019419 -1.183498 -4.596653
H  -2.44743 -0.188177 -4.729969
H  -2.138751 -1.758185 -5.51808
H  -2.544736 -1.687083 -3.783017
H  0.122415 0.70717 -5.794444
H  0.28797 -0.910696 -6.526749
H  1.588144 -0.250865 -5.499631
H  1.430442 -2.723188 -3.944043
H  0.142628 -3.244027 -5.062504
H  -0.131965 -3.267614 -3.300401
C  0.439326 0.833219 3.081756
C  -0.754127 0.122772 3.230453
C  1.355342 0.781277 4.131131
C  -1.022295 -0.616435 4.366327
H  -1.489975 0.136571 2.432525
C  1.101533 0.052043 5.281008
H  2.283108 1.339773 4.065846
C  -0.090749 -0.684327 5.424929
H  -1.960595 -1.150249 4.427554
H  1.838342 0.062124 6.072096
N  -0.334743 -1.447102 6.545654
C  -1.691289 -1.91029 6.793981
C  0.511994 -1.262975 7.713662
H  -1.696726 -2.501201 7.708686
H  -2.40083 -1.080081 6.910137
H  -2.039509 -2.553368 5.983346
H  0.193838 -1.958819 8.488653
H  1.554958 -1.48488 7.478172
H  0.454394 -0.242348 8.115484
elementType: C H Au P N
totalener: -1195.81126529467610 hartree
nucrepener: 1772.61629448226086 hartree
electener: -2968.35014099330419 hartree
oneelecener: -5184.83681866483494 hartree
twoeener: 2216.48667767153074 hartree
cpcmener: -0.06878888102449 hartree
kineticenergy: 1101.35091946157695 hartree
exchangeener: -93.306425612811 hartree
energy: -2098.4346 -392.8099 -281.4876 -281.4050 -281.0369 -280.7080 -280.6490 -280.1622 -280.1596 -280.0772 -280.0159 -279.9555 -279.9342 -279.9247 -279.7890 -279.7857 -279.7804 -279.6381 -279.6072 -182.2163 -131.9549 -131.9549 -131.9133 -116.8173 -67.5160 -67.1174 -67.0626 -29.7376 -29.0800 -27.1445 -25.3626 -25.3033 -24.5701 -24.3321 -23.5743 -23.1829 -22.9453 -22.9425 -21.8711 -21.2695 -20.0347 -19.6975 -18.8352 -18.7948 -18.5453 -18.0089 -17.1256 -16.5403 -16.3270 -15.9628 -15.9161 -15.4891 -15.3649 -15.2374 -15.2334 -14.8596 -14.7608 -14.5868 -14.4591 -14.3826 -14.3806 -14.1185 -13.9689 -13.8973 -13.8923 -13.5969 -13.5161 -13.3645 -13.1980 -12.8328 -12.7210 -12.5638 -12.3197 -12.1140 -11.8744 -11.7070 -11.6905 -11.6040 -11.3830 -10.5941 -10.2131 -9.9699 -9.8634 -7.9394 -0.8594 1.0376 1.2980 1.3681 1.4854 1.5318 1.7144 1.9530 1.9977 2.1993 2.2207 electronvolt
chargesum: 1.0000000
charge: 0.222203 0.128689 0.125356 0.039187 0.243850 0.023419 -0.114614 0.119354 0.048479 1.349289 -0.387177 0.125402 0.052981 -0.547040 0.268447 -0.421399 -0.425284 -0.431977 0.138421 0.164616 0.135916 0.139188 0.164081 0.135731 0.139088 0.163898 0.137833 -0.268986 -0.508572 -0.311292 -0.303164 0.014804 -0.118745 0.010737 0.726438 0.012408 0.029098 -0.018394 -0.367552 -0.379149 0.129596 0.158012 0.078640 0.136473 0.083214 0.158497
charge: -0.026334 0.012250 0.040386 -0.175123 -0.061659 0.029477 0.159895 0.033077 0.040083 -0.217602 0.062423 0.022771 0.040761 0.609832 0.723256 -0.022493 -0.022751 -0.022827 -0.045486 -0.036590 -0.045650 -0.045501 -0.036521 -0.045416 -0.045577 -0.036621 -0.045490 -0.147793 0.057078 0.059986 0.068299 0.024268 0.066614 0.020233 -0.195445 -0.004087 -0.004977 -0.099251 0.140783 0.139478 0.001364 0.014800 -0.000562 0.001458 0.000513 0.014669
qa: 0.2222 0.1287 0.1254 0.0392 0.2439 0.0234 -0.1146 0.1194 0.0485 1.3493 -0.3872 0.1254 0.0530 -0.5470 0.2684 -0.4214 -0.4253 -0.4320 0.1384 0.1646 0.1359 0.1392 0.1641 0.1357 0.1391 0.1639 0.1378 -0.2690 -0.5086 -0.3113 -0.3032 0.0148 -0.1187 0.0107 0.7264 0.0124 0.0291 -0.0184 -0.3676 -0.3791 0.1296 0.1580 0.0786 0.1365 0.0832 0.1585
va: 3.7374 1.0038 0.9815 2.9122 3.5142 1.0220 4.2418 0.9614 1.0183 0.7359 4.4589 0.9590 0.9980 1.5051 3.6881 4.0612 4.0373 4.0644 1.0835 1.0797 1.0893 1.0839 1.0803 1.0888 1.0827 1.0810 1.0853 0.3613 3.2094 3.1497 3.1122 1.0158 2.9432 0.9783 2.5208 0.9432 0.9242 2.8188 3.9796 3.9781 1.0070 1.0439 1.0520 1.0051 1.0538 1.0421
dispersion: -0.116615106 hartree
energy: -1195.927880400882 hartree
dipole: -9.949698116 9.942835035 -0.006863081 -25.904446212 25.892449022 -0.011997189 335.311409222 -336.438454512 -1.127045290
dipolemethod: SCF
magnitude: 1.127130037 au
magnitude: 2.864936874 debye
