program: Orca
programVersion: 6.1.x
elementType: C H H C C H C H H C C H H Au P C C C H H H H H H H H H C C C C H C H C H H O H
elementType: Au
charge: 1
multiplicity: 1
keywords: wb97x-d3bj def2-TZVPPD def2/J defgrid3 verytightscf
formula: C15H21AuOP
InChI: InChI=1/C12H12O.C3H9P.Au/c13-11-5-3-9(4-6-11)12-7-1-2-10(12)8-12;1-4(2)3;/h3-6,10,13H,1,7-8H2;1-3H3;/rC15H21AuOP/c1-18(2,3)16-14-8-9-15(10-13(14)15)11-4-6-12(17)7-5-11/h4-7,13,17H,8-10H2,1-3H3
39 atoms
C  -1.104858 2.034049 0.534529
H  -2.044746 1.892348 0.000341
H  -0.724868 3.016047 0.215451
C  -0.082382 1.031071 0.1164
C  0.756826 0.717694 1.186979
H  1.416115 -0.138372 1.194399
C  1.236449 1.925543 2.068758
H  2.18241 1.693912 2.541316
H  1.162414 2.902107 1.606384
C  0.043184 1.256382 2.530649
C  -1.25122 1.900356 2.057312
H  -2.096045 1.251474 2.291787
H  -1.40732 2.85775 2.559086
Au 0.009378 0.189538 -1.73493
P  0.112725 -0.76257 -3.84607
C  1.373064 -0.016149 -4.909425
C  0.499865 -2.530443 -3.821277
C  -1.433041 -0.629421 -4.777885
H  -1.693644 0.423541 -4.900262
H  -1.321508 -1.093978 -5.760367
H  -2.23274 -1.128668 -4.227592
H  1.160317 1.047144 -5.034497
H  1.375528 -0.504976 -5.886447
H  2.354105 -0.127469 -4.443945
H  1.465909 -2.684115 -3.336848
H  0.537032 -2.920591 -4.841037
H  -0.266962 -3.062722 -3.25542
C  0.052079 0.363353 3.720586
C  -0.806188 -0.737796 3.77732
C  0.890747 0.609107 4.804008
C  -0.824285 -1.574207 4.878927
H  -1.462133 -0.950577 2.939244
C  0.88081 -0.219014 5.919214
H  1.557072 1.464671 4.78829
C  0.022632 -1.313411 5.956133
H  -1.485464 -2.432642 4.918154
H  1.534945 -0.014404 6.761402
O  -0.031757 -2.162002 7.01922
H  0.600036 -1.871499 7.692177
elementType: C H Au P O
totalener: -1137.00716151865504 hartree
nucrepener: 1520.27732935867903 hartree
electener: -2657.20243846059566 hartree
oneelecener: -4605.69163491632571 hartree
twoeener: 1948.48919645572983 hartree
cpcmener: -0.07470333330521 hartree
kineticenergy: 1042.93865319500401 hartree
exchangeener: -86.596305971076 hartree
energy: -2098.4662 -524.0041 -281.7157 -281.6907 -281.2861 -280.8061 -280.6966 -280.1706 -280.1522 -280.0885 -280.0630 -280.0318 -279.8682 -279.8239 -279.8117 -279.8051 -279.8007 -182.2484 -131.9869 -131.9867 -131.9459 -116.8913 -67.5928 -67.1923 -67.1317 -32.8406 -29.2033 -27.4352 -25.4553 -25.3365 -24.5752 -24.4607 -23.4874 -22.9675 -22.9635 -21.5178 -20.8995 -20.3225 -19.0161 -18.8826 -18.6289 -18.3957 -17.8178 -16.5809 -16.3337 -16.0648 -15.5483 -15.3656 -15.2586 -15.2555 -14.9583 -14.8846 -14.7154 -14.5569 -14.4244 -14.4035 -14.2595 -14.0494 -13.9123 -13.6345 -13.5196 -13.0965 -12.8519 -12.7463 -12.5382 -12.4268 -12.1479 -11.9649 -11.7628 -11.7470 -11.6438 -11.1833 -10.2691 -10.1587 -10.0076 -8.8922 -0.9359 1.0075 1.2708 1.3288 1.3529 1.4632 1.6345 1.7483 1.9717 2.1259 2.2607 electronvolt
chargesum: 1.0000000
charge: 0.186123 0.130289 0.130521 0.161460 0.302909 0.019014 -0.128365 0.134873 0.044114 1.372628 -0.366908 0.135581 0.051306 -0.605584 0.240418 -0.424351 -0.426011 -0.423823 0.138507 0.165517 0.137400 0.136989 0.164978 0.138736 0.140014 0.163855 0.136641 -0.430302 -0.307262 -0.042480 -0.359221 0.072710 -0.302323 0.067910 0.607035 0.046209 -0.001836 -0.400932 0.193659
charge: -0.023061 0.016551 0.042608 -0.157974 -0.066477 0.033011 0.174701 0.034883 0.039239 -0.241970 0.066949 0.025896 0.039668 0.616203 0.724457 -0.021848 -0.021962 -0.022270 -0.045333 -0.036347 -0.045362 -0.045238 -0.036237 -0.045272 -0.045272 -0.036282 -0.045288 -0.136681 0.064298 0.066597 0.075782 0.027971 0.075425 0.023036 -0.262881 0.022152 0.024313 0.275605 -0.133588
qa: 0.1861 0.1303 0.1305 0.1615 0.3029 0.0190 -0.1284 0.1349 0.0441 1.3726 -0.3669 0.1356 0.0513 -0.6056 0.2404 -0.4244 -0.4260 -0.4238 0.1385 0.1655 0.1374 0.1370 0.1650 0.1387 0.1400 0.1639 0.1366 -0.4303 -0.3073 -0.0425 -0.3592 0.0727 -0.3023 0.0679 0.6070 0.0462 -0.0018 -0.4009 0.1937
va: 3.8614 1.0193 0.9756 2.7556 3.3484 0.9940 4.1926 0.9545 1.0401 0.9077 4.4442 0.9517 1.0026 1.4413 3.6792 4.0707 4.0572 4.0341 1.0837 1.0812 1.0878 1.0882 1.0788 1.0851 1.0801 1.0796 1.0878 0.3495 3.5012 3.4703 3.5064 0.9592 3.4871 0.9346 2.9213 0.9838 0.9769 1.9406 1.0048
dispersion: -0.103128497 hartree
energy: -1137.110290015540 hartree
dipole: 1.567148862 -0.896334273 0.670814590 -24.439134893 25.300130700 0.860995807 241.057399662 -242.463494012 -1.406094349
dipolemethod: SCF
magnitude: 1.780002054 au
magnitude: 4.524405661 debye
