program: Orca
programVersion: 6.1.x
elementType: C H H C C H C H H C C H H Au P C C C H H H H H H H H H C C C C H C H C H H C N
elementType: Au
charge: 1
multiplicity: 1
keywords: wb97x-d3bj def2-TZVPPD def2/J defgrid3 verytightscf
formula: C16H20AuNP
InChI: InChI=1/C13H11N.C3H9P.Au/c14-9-10-3-5-11(6-4-10)13-7-1-2-12(13)8-13;1-4(2)3;/h3-6,12H,1,7-8H2;1-3H3;/rC16H20AuNP/c1-19(2,3)17-15-8-9-16(10-14(15)16)13-6-4-12(11-18)5-7-13/h4-7,14H,8-10H2,1-3H3
39 atoms
C  -1.682486 -1.648346 0.402462
H  -1.274474 -2.570905 -0.013576
H  -2.690187 -1.555417 -0.029333
C  -0.913307 -0.466284 -0.073342
C  -0.826524 0.490869 0.950571
H  -0.129423 1.316231 0.935307
C  -2.200272 0.802905 1.651894
H  -2.212562 1.819621 2.023203
H  -3.090935 0.474637 1.131591
C  -1.338841 -0.170165 2.293906
C  -1.660049 -1.614783 1.938928
H  -0.875026 -2.273041 2.313961
H  -2.60715 -1.922321 2.386117
Au -0.075416 -0.292707 -1.917344
P  0.884788 -0.083267 -4.018255
C  0.354472 1.402605 -4.905177
C  2.691372 0.013095 -3.966902
C  0.513604 -1.460062 -5.132192
H  -0.566521 -1.533509 -5.271874
H  0.996295 -1.300863 -6.099212
H  0.876594 -2.390958 -4.692558
H  -0.728416 1.378895 -5.040331
H  0.842581 1.449557 -5.881387
H  0.618441 2.287183 -4.322679
H  2.992937 0.874746 -3.368458
H  3.089289 0.114872 -4.979235
H  3.091239 -0.892881 -3.507764
C  -0.600435 0.143034 3.551753
C  0.663779 -0.409759 3.762799
C  -1.163835 0.962564 4.526273
C  1.361564 -0.144937 4.927227
H  1.107462 -1.044068 3.003313
C  -0.476378 1.235035 5.699659
H  -2.149532 1.386263 4.373395
C  0.786366 0.680716 5.895407
H  2.345914 -0.567087 5.090874
H  -0.913508 1.870541 6.460475
C  1.50785 0.963501 7.109479
N  2.085221 1.189363 8.078205
elementType: C H Au P N
totalener: -1154.03662777151976 hartree
nucrepener: 1567.35857716145688 hartree
electener: -2721.30210847944591 hartree
oneelecener: -4718.19741207858260 hartree
twoeener: 1996.89530359913670 hartree
cpcmener: -0.08721871906222 hartree
kineticenergy: 1059.90645579017041 hartree
exchangeener: -88.723660754722 hartree
energy: -2098.5085 -392.5878 -281.9487 -281.3091 -281.1884 -281.1499 -280.9380 -280.8184 -280.7705 -280.5099 -280.5076 -280.2924 -280.2878 -280.2636 -280.1282 -279.8391 -279.8375 -279.8295 -182.2908 -132.0291 -132.0289 -131.9888 -116.9760 -67.6803 -67.2777 -67.2123 -29.4051 -28.9791 -27.9752 -25.8233 -25.3757 -25.1834 -24.8096 -23.8628 -22.9969 -22.9936 -21.9143 -21.3550 -20.6711 -19.2697 -18.9616 -18.8655 -18.7193 -17.8575 -16.7006 -16.4586 -16.0947 -15.7268 -15.4521 -15.2887 -15.2855 -15.2292 -14.9530 -14.6895 -14.6711 -14.4411 -14.4326 -14.1912 -14.0468 -13.9410 -13.7097 -13.5829 -13.2976 -13.2096 -12.8999 -12.7963 -12.6544 -12.5146 -12.2424 -12.0519 -11.8518 -11.8245 -11.6929 -11.4636 -10.4012 -10.3020 -10.2978 -9.7577 -1.0981 0.3299 0.9655 1.1026 1.2475 1.3783 1.4981 1.7265 1.9463 2.1227 2.2951 electronvolt
chargesum: 1.0000000
charge: 0.187066 0.133493 0.133211 0.200669 0.311716 0.017469 -0.127840 0.136629 0.046401 1.236873 -0.364433 0.145585 0.047029 -0.637380 0.236414 -0.428558 -0.424428 -0.424539 0.138592 0.164785 0.139016 0.138414 0.165256 0.140077 0.140738 0.164147 0.137870 -0.074321 -0.023712 0.210966 -0.571820 0.100198 -0.562997 0.075648 0.653085 0.027602 0.034058 -0.309128 -0.313846
charge: -0.018389 0.021546 0.044581 -0.143429 -0.068293 0.036992 0.187470 0.036585 0.039161 -0.254906 0.073495 0.028162 0.039810 0.622486 0.725700 -0.021324 -0.021392 -0.021399 -0.045030 -0.036056 -0.045042 -0.045010 -0.035997 -0.045088 -0.045041 -0.035900 -0.045096 -0.105205 0.081474 0.086446 0.074591 0.031815 0.075400 0.026423 -0.195266 0.028771 0.029178 -0.173798 0.111575
qa: 0.1871 0.1335 0.1332 0.2007 0.3117 0.0175 -0.1278 0.1366 0.0464 1.2369 -0.3644 0.1456 0.0470 -0.6374 0.2364 -0.4286 -0.4244 -0.4245 0.1386 0.1648 0.1390 0.1384 0.1653 0.1401 0.1407 0.1641 0.1379 -0.0743 -0.0237 0.2110 -0.5718 0.1002 -0.5630 0.0756 0.6531 0.0276 0.0341 -0.3091 -0.3138
va: 3.9123 1.0171 0.9678 2.6568 3.3352 0.9771 4.1706 0.9582 1.0413 0.9773 4.4733 0.9435 0.9998 1.4260 3.6785 4.0646 4.0669 4.0317 1.0839 1.0820 1.0838 1.0854 1.0788 1.0822 1.0813 1.0789 1.0876 0.1994 3.0262 2.8724 3.0381 0.9332 3.0188 0.9288 2.3698 1.0196 1.0121 2.6631 2.3936
dispersion: -0.106282030 hartree
energy: -1154.142909801890 hartree
dipole: 10.687847508 -12.388869408 -1.701021900 30.254666147 -30.856613013 -0.601946866 259.116848838 -263.613546379 -4.496697541
dipolemethod: SCF
magnitude: 4.845214578 au
magnitude: 12.315556724 debye
