program: Orca
programVersion: 6.1.x
elementType: Au C C C C H C H H C P C C H C H H H H H H H H H H H H C C C C H C H C H H Cl
elementType: Au
charge: 1
multiplicity: 1
keywords: wb97x-d3bj def2-TZVPPD def2/J defgrid3 verytightscf
formula: C15H20ClAuP
InChI: InChI=1/C12H11Cl.C3H9P.Au/c1-3-4-5-10(2)11-6-8-12(13)9-7-11;1-4(2)3;/h1,6-9H,2,4-5H2;1-3H3;/rC15H20AuClP/c1-12(14-8-10-15(17)11-9-14)6-7-13(2)16-18(3,4)5/h2,8-11H,1,6-7H2,3-5H3
38 atoms
Au -0.138541 -1.905238 0.157106
C  0.930012 0.24452 1.430163
C  -0.267963 -0.055956 1.1642
C  0.042964 2.471827 2.111506
C  1.146892 2.009236 2.749083
H  1.045314 1.388506 3.631731
C  -1.527818 0.691342 1.395532
H  -2.326226 0.043158 1.757819
H  -1.852474 1.106964 0.437768
C  -1.26639 1.837426 2.422609
P  -0.13173 -3.908334 -0.955159
C  0.523321 -3.796055 -2.637282
C  0.856464 -5.185262 -0.139986
H  1.993883 0.109397 1.359199
C  -1.784101 -4.621883 -1.131757
H  -2.422159 -3.929431 -1.683734
H  -1.724732 -5.571108 -1.669442
H  -2.215582 -4.789296 -0.143232
H  -0.078231 -3.091841 -3.214765
H  0.494291 -4.778474 -3.114535
H  1.553479 -3.436976 -2.603692
H  1.893411 -4.85214 -0.068558
H  0.810221 -6.114266 -0.713168
H  0.469994 -5.357509 0.866136
H  2.134677 2.397555 2.527945
H  -2.098939 2.537804 2.359498
H  -1.240853 1.409029 3.424583
C  0.133105 3.431469 0.983479
C  -0.907634 4.324474 0.722858
C  1.260489 3.458867 0.157308
C  -0.823746 5.234267 -0.322119
H  -1.790847 4.335173 1.349424
C  1.352803 4.353525 -0.89622
H  2.070759 2.758297 0.320497
C  0.306643 5.236276 -1.122067
H  -1.630157 5.932232 -0.510845
H  2.224694 4.361487 -1.538848
Cl 0.415491 6.366807 -2.445097
elementType: Au C H P Cl
totalener: -1521.30924174013671 hartree
nucrepener: 1612.91075587569708 hartree
electener: -3134.13745829456229 hartree
oneelecener: -5321.41955302864972 hartree
twoeener: 2187.28209473408742 hartree
cpcmener: -0.07542519073029 hartree
kineticenergy: 1426.87186599498909 hartree
exchangeener: -101.069024140989 hartree
energy: -2762.9817 -2098.6221 -281.7515 -281.5340 -281.1660 -280.5903 -280.5540 -280.5473 -280.2853 -280.2836 -280.2772 -280.2534 -280.2445 -280.1456 -279.8409 -279.8386 -279.8384 -260.6124 -199.5204 -199.2814 -199.2714 -182.3892 -132.1261 -132.1259 -132.0942 -116.8544 -67.5672 -67.1608 -67.1431 -28.5582 -27.7086 -26.7874 -25.5256 -25.3922 -24.7743 -24.2742 -23.7707 -23.0078 -23.0069 -21.6422 -20.6010 -20.5921 -19.1583 -18.8301 -18.5677 -17.3987 -16.6952 -16.4576 -16.3084 -15.9844 -15.8005 -15.4559 -15.3972 -15.3043 -15.2793 -15.0739 -14.6594 -14.4792 -14.4414 -14.4288 -13.9471 -13.9064 -13.5624 -13.4043 -12.9931 -12.9184 -12.8019 -12.7666 -12.5682 -12.2390 -11.9984 -11.8085 -11.7978 -11.7801 -11.5499 -10.7433 -10.4022 -10.2300 -10.1882 -9.1210 -0.4868 0.6584 0.9714 1.1415 1.2443 1.3878 1.5233 1.5957 1.8611 1.9091 2.0036 electronvolt
chargesum: 1.0000000
charge: -0.303198 -0.105357 0.212083 0.013361 -0.216786 0.147270 0.256849 0.128866 0.120529 -0.000161 0.295136 -0.416024 -0.419675 0.021164 -0.414427 0.141191 0.165817 0.140382 0.137163 0.165124 0.141372 0.139896 0.166228 0.138012 0.168093 0.050157 0.144160 0.557980 0.096456 -0.054538 -0.425955 0.032180 -0.475162 0.033076 0.456388 0.042407 0.024346 -0.304404
charge: 0.619646 0.173632 -0.318965 -0.172480 0.194084 0.006141 -0.012298 0.019150 0.029030 0.043688 0.725231 -0.019808 -0.019523 -0.013953 -0.019455 -0.044415 -0.035180 -0.044358 -0.044475 -0.035162 -0.044510 -0.044386 -0.035168 -0.044535 0.003224 0.021519 0.034056 -0.130735 0.074472 0.068668 -0.008171 0.019519 -0.007405 0.019040 -0.627151 0.012921 0.012877 0.645240
qa: -0.3032 -0.1054 0.2121 0.0134 -0.2168 0.1473 0.2568 0.1289 0.1205 -0.0002 0.2951 -0.4160 -0.4197 0.0212 -0.4144 0.1412 0.1658 0.1404 0.1372 0.1651 0.1414 0.1399 0.1662 0.1380 0.1681 0.0502 0.1442 0.5580 0.0965 -0.0545 -0.4260 0.0322 -0.4752 0.0331 0.4564 0.0424 0.0243 -0.3044
va: 1.8389 3.4221 2.7797 2.8303 3.7155 1.0205 3.9681 1.0008 1.0023 4.1116 3.7704 4.0529 4.0538 1.0592 4.0273 1.0813 1.0794 1.0827 1.0910 1.0791 1.0806 1.0800 1.0792 1.0886 0.9743 1.0533 0.9442 1.8080 3.1220 3.1199 3.5991 0.9250 3.7167 0.9336 2.8634 0.9388 0.9554 0.9881
dispersion: -0.109329306 hartree
energy: -1521.418571046050 hartree
dipole: 12.165556723 -12.126278243 0.039278480 251.688383098 -254.670948592 -2.982565494 -16.777731052 17.818897702 1.041166650
dipolemethod: SCF
magnitude: 3.159314438 au
magnitude: 8.030339119 debye
