program: Orca
programVersion: 6.1.x
elementType: Au C C C C H C H H C P C C H C H H H H H H H H H H H H C C C C H C H C C C N F F F F F F O O
elementType: Au
charge: 1
multiplicity: 1
keywords: wb97x-d3bj def2-TZVPPD def2/J defgrid3 verytightscf
formula: C17H18F6AuNO2P
InChI: InChI=1/C14H9F6NO2.C3H9P.Au/c1-3-4-5-8(2)9-6-10(13(15,16)17)12(21(22)23)11(7-9)14(18,19)20;1-4(2)3;/h1,6-7H,2,4-5H2;1-3H3;/rC17H18AuF6NO2P/c1-10(6-7-11(2)18-28(3,4)5)12-8-13(16(19,20)21)15(25(26)27)14(9-12)17(22,23)24/h2,8-9H,1,6-7H2,3-5H3
46 atoms
Au -0.136668 -3.278733 -0.028215
C  -1.723772 -1.169273 0.766341
C  -1.303254 -1.56013 -0.365888
C  -2.51951 0.85511 -0.341556
C  -3.194733 0.386239 0.740331
H  -4.008147 -0.317011 0.606115
C  -1.487119 -0.937957 -1.699449
H  -1.716759 -1.675137 -2.469205
H  -0.546063 -0.456453 -1.978842
C  -2.634811 0.122241 -1.626608
P  1.160467 -5.15096 0.231138
C  2.413508 -4.985145 1.525047
C  0.214151 -6.628989 0.667923
H  -1.706762 -1.226764 1.840463
C  2.075319 -5.593739 -1.264871
H  2.731458 -4.768681 -1.547899
H  2.67336 -6.489869 -1.083562
H  1.373184 -5.782616 -2.078892
H  3.072176 -4.147587 1.288272
H  3.001355 -5.903474 1.593988
H  1.925365 -4.791818 2.481978
H  -0.309923 -6.459821 1.610312
H  0.885812 -7.484352 0.772252
H  -0.520043 -6.834826 -0.113046
H  -3.105065 0.859059 1.711975
H  -2.54266 0.775406 -2.493801
H  -3.59212 -0.396191 -1.670666
C  -1.523298 1.950353 -0.217724
C  -0.772593 2.10119 0.945526
C  -1.326045 2.843727 -1.265405
C  0.156991 3.120667 1.068577
H  -0.892796 1.404008 1.763264
C  -0.406276 3.877235 -1.158507
H  -1.90769 2.757503 -2.172839
C  0.331622 4.003466 0.00965
C  0.951725 3.227521 2.3559
C  -0.241776 4.824309 -2.331788
N  1.32814 5.092302 0.128576
F  0.973376 2.057846 3.014616
F  0.427796 4.139925 3.192276
F  2.232343 3.57542 2.130401
F  -1.333938 4.827079 -3.111724
F  0.79798 4.477562 -3.110626
F  -0.039722 6.0935 -1.932299
O  1.096017 5.963489 0.937405
O  2.300085 5.026919 -0.591516
elementType: Au C H P N F O
totalener: -1940.72782917302106 hartree
nucrepener: 3147.08708324384452 hartree
electener: -5087.71726248213963 hartree
oneelecener: -8957.34562513048513 hartree
twoeener: 3869.62836264834505 hartree
cpcmener: -0.09500343113774 hartree
kineticenergy: 1844.18926274527394 hartree
exchangeener: -146.421153662265 hartree
energy: -2098.6235 -675.4446 -675.4366 -675.4270 -675.4145 -675.3356 -675.3220 -524.8503 -524.8487 -399.8815 -287.3908 -287.3741 -282.7809 -281.7886 -281.7848 -281.6212 -281.6146 -281.3776 -281.2132 -281.2052 -280.6727 -280.6478 -280.6401 -280.3490 -279.8492 -279.8475 -279.8473 -182.3914 -132.1285 -132.1282 -132.0960 -116.8567 -67.5678 -67.1598 -67.1475 -40.1968 -40.1783 -38.5395 -37.7242 -37.7019 -37.6422 -37.6250 -33.6398 -29.4951 -28.0120 -26.7463 -26.7165 -25.5125 -25.4002 -24.5244 -24.4521 -23.5325 -23.0941 -23.0162 -23.0155 -22.0213 -21.5907 -21.3508 -20.6875 -20.2643 -20.1616 -20.1275 -20.0172 -19.5561 -19.2153 -18.9791 -18.8174 -18.7797 -18.2916 -18.1907 -17.3638 -17.2798 -16.7763 -16.7449 -16.6760 -16.5584 -16.5056 -16.0922 -15.9636 -15.8179 -15.6758 -15.6230 -15.6043 -15.5315 -15.4464 -15.3144 -15.3056 -15.1628 -15.0689 -15.0458 -14.8449 -14.8049 -14.5427 -14.4478 -14.4357 -13.9561 -13.8276 -13.7814 -13.4175 -13.1358 -12.9598 -12.8619 -12.6865 -12.4636 -12.3565 -12.2672 -12.1875 -11.8060 -11.7797 -11.6768 -11.1958 -11.0992 -10.6947 -10.2418 -9.7097 -1.0659 -0.3723 0.0986 0.4768 0.8704 1.1242 1.2161 1.4735 1.5963 1.7029 1.7878 electronvolt
chargesum: 1.0000000
charge: -0.314204 -0.156233 0.239563 -0.139755 -0.117862 0.137838 0.219350 0.133480 0.122481 0.031519 0.296744 -0.423193 -0.419934 0.016419 -0.420916 0.140917 0.165254 0.141928 0.138697 0.165147 0.140933 0.139967 0.165362 0.138143 0.145574 0.070402 0.138487 0.951018 -0.171330 -0.167892 -0.261764 -0.017208 0.197865 0.019602 -0.360125 0.650914 0.720915 1.034167 -0.249617 -0.232716 -0.245495 -0.252962 -0.232291 -0.243368 -0.517439 -0.518384
charge: 0.616424 0.163995 -0.318677 -0.150877 0.207108 0.015124 -0.009751 0.019639 0.030295 0.055372 0.724322 -0.019944 -0.020062 -0.010134 -0.019555 -0.044442 -0.035224 -0.044435 -0.044600 -0.035168 -0.044491 -0.044562 -0.035219 -0.044537 0.014284 0.026992 0.037761 -0.068356 0.158994 0.164595 0.007528 0.034599 0.006910 0.037273 -0.013543 -0.553752 -0.554027 -0.353126 0.149761 0.153501 0.152308 0.151044 0.152657 0.152727 0.115948 0.115320
qa: -0.3142 -0.1562 0.2396 -0.1398 -0.1179 0.1378 0.2193 0.1335 0.1225 0.0315 0.2967 -0.4232 -0.4199 0.0164 -0.4209 0.1409 0.1653 0.1419 0.1387 0.1651 0.1409 0.1400 0.1654 0.1381 0.1456 0.0704 0.1385 0.9510 -0.1713 -0.1679 -0.2618 -0.0172 0.1979 0.0196 -0.3601 0.6509 0.7209 1.0342 -0.2496 -0.2327 -0.2455 -0.2530 -0.2323 -0.2434 -0.5174 -0.5184
va: 1.8119 3.5148 2.8044 2.7569 3.6265 1.0208 4.0080 1.0078 1.0159 4.2597 3.7600 4.0456 4.0649 1.0592 4.0346 1.0823 1.0812 1.0803 1.0893 1.0807 1.0806 1.0830 1.0789 1.0881 1.0008 1.0614 0.9565 1.2750 2.2314 2.1399 3.0177 0.8765 2.6279 0.8117 4.4905 3.3529 3.2939 4.0583 0.9608 0.9957 0.9351 0.9607 0.9952 0.9329 1.7684 1.7669
dispersion: -0.127083820 hartree
energy: -1940.854912993345 hartree
dipole: 12.474221959 -15.230788323 -2.756566364 413.241515516 -420.568415965 -7.326900448 -1.589308838 1.545146610 -0.044162228
dipolemethod: SCF
magnitude: 7.828414820 au
magnitude: 19.898249133 debye
