program: Orca
programVersion: 6.1.x
elementType: Au C C C C H C H H C P C C H C H H H H H H H H H H H H C C C C H C H C H N C C H H H H H H F
elementType: Au
charge: 1
multiplicity: 1
keywords: wb97x-d3bj def2-TZVPPD def2/J defgrid3 verytightscf
formula: C17H25FAuNP
InChI: InChI=1/C14H16FN.C3H9P.Au/c1-5-6-7-11(2)12-8-9-14(16(3)4)13(15)10-12;1-4(2)3;/h1,8-10H,2,6-7H2,3-4H3;1-3H3;/rC17H25AuFNP/c1-13(8-9-14(2)18-21(5,6)7)15-10-11-17(20(3)4)16(19)12-15/h2,10-12H,1,8-9H2,3-7H3
46 atoms
Au -0.03367 -2.453294 0.137471
C  1.207532 -0.367709 1.25627
C  -0.020175 -0.63523 1.222172
C  0.446839 1.905103 2.177933
C  1.621388 1.386664 2.616074
H  1.634032 0.716135 3.467484
C  -1.225481 0.073677 1.704324
H  -1.896997 -0.602138 2.235239
H  -1.768885 0.445188 0.832916
C  -0.808262 1.247642 2.650661
P  -0.208513 -4.416399 -1.029483
C  0.625517 -4.376025 -2.633687
C  0.490317 -5.839695 -0.160138
H  2.246341 -0.479019 1.006882
C  -1.921848 -4.866947 -1.392241
H  -2.38695 -4.077775 -1.985698
H  -1.949348 -5.8066 -1.948886
H  -2.475038 -4.979936 -0.458185
H  0.200429 -3.577815 -3.244739
H  0.497342 -5.33402 -3.143258
H  1.689139 -4.180743 -2.485843
H  1.551181 -5.66567 0.028368
H  0.369883 -6.74116 -0.765562
H  -0.022256 -5.96997 0.794618
H  2.580479 1.743127 2.259671
H  -1.642217 1.947194 2.713852
H  -0.63424 0.826892 3.641068
C  0.383111 2.968126 1.153088
C  -0.799156 3.215133 0.445798
C  1.490907 3.761007 0.848066
C  -0.834684 4.189775 -0.521924
H  -1.702017 2.64225 0.612504
C  1.429211 4.752521 -0.118598
H  2.418933 3.631986 1.391121
C  0.257685 5.007203 -0.842498
H  2.309468 5.353089 -0.304983
N  0.163834 5.970316 -1.853163
C  1.420268 6.556059 -2.298022
C  -0.860347 6.999653 -1.658036
H  1.220672 7.147988 -3.19299
H  1.873766 7.216344 -1.544794
H  2.133198 5.771546 -2.556493
H  -0.555678 7.72077 -0.886285
H  -1.002539 7.537045 -2.597589
H  -1.810157 6.55793 -1.367775
F  -1.989927 4.333347 -1.222208
elementType: Au C H P N F
totalener: -1295.04938938349142 hartree
nucrepener: 1918.72135021739791 hartree
electener: -3213.69028743834224 hartree
oneelecener: -5614.59027084738227 hartree
twoeener: 2400.89998340904003 hartree
cpcmener: -0.07439020911169 hartree
kineticenergy: 1200.38272008014246 hartree
exchangeener: -100.253661477606 hartree
energy: -2098.6400 -674.4279 -392.7943 -282.1250 -281.4830 -281.1886 -280.9534 -280.6123 -280.5403 -280.3358 -280.1393 -280.1067 -280.1057 -280.0760 -280.0542 -280.0256 -279.9412 -279.8422 -279.8417 -279.8414 -182.4062 -132.1429 -132.1427 -132.1121 -116.8848 -67.6001 -67.1951 -67.1707 -37.2211 -29.7076 -27.8698 -27.0214 -25.6238 -25.4043 -24.5650 -24.3119 -24.0093 -23.0770 -23.0123 -23.0093 -21.8426 -21.5649 -20.4627 -20.0624 -19.2625 -18.8539 -18.6343 -17.5744 -17.3075 -17.0772 -16.7374 -16.5007 -16.2295 -15.9005 -15.8216 -15.5957 -15.5247 -15.3111 -15.2964 -15.2326 -15.0724 -14.7829 -14.5920 -14.4461 -14.4388 -14.0720 -13.9488 -13.8298 -13.6590 -13.5084 -13.3631 -13.3351 -13.0693 -12.9562 -12.9039 -12.7971 -12.3892 -12.2082 -12.0434 -11.8281 -11.8047 -11.5746 -11.0924 -10.6935 -10.2421 -9.8679 -9.7802 -8.2376 -0.4662 0.7020 1.0229 1.2867 1.4728 1.5482 1.6218 1.8273 1.8861 2.0617 2.1422 electronvolt
chargesum: 1.0000000
charge: -0.289543 -0.033486 0.114559 0.356300 -0.421574 0.145371 0.355139 0.099749 0.128235 -0.044686 0.315702 -0.421240 -0.414312 0.020609 -0.414310 0.141392 0.164719 0.141305 0.139007 0.164875 0.140918 0.140296 0.166180 0.136926 0.136305 0.069985 0.186378 0.748414 -0.447250 -0.825749 0.499358 -0.084742 0.241564 -0.026958 -0.039176 0.029097 0.031464 -0.436325 -0.335191 0.124486 0.185292 0.123328 0.139848 0.106663 0.094539 -0.353458
charge: 0.625447 0.184461 -0.315517 -0.171396 0.185108 0.001638 -0.015261 0.020857 0.016311 0.038194 0.726852 -0.019161 -0.019101 -0.017111 -0.018807 -0.044161 -0.034984 -0.044167 -0.044288 -0.034952 -0.044151 -0.044223 -0.035013 -0.044230 -0.007879 0.028515 0.030816 -0.133834 0.123540 0.065002 -0.178527 0.022383 0.083136 0.013164 -0.156542 0.007714 -0.101979 0.118362 0.149786 0.006853 0.009533 0.008745 0.012743 0.006336 -0.012250 0.052035
qa: -0.2895 -0.0335 0.1146 0.3563 -0.4216 0.1454 0.3551 0.0997 0.1282 -0.0447 0.3157 -0.4212 -0.4143 0.0206 -0.4143 0.1414 0.1647 0.1413 0.1390 0.1649 0.1409 0.1403 0.1662 0.1369 0.1363 0.0700 0.1864 0.7484 -0.4472 -0.8257 0.4994 -0.0847 0.2416 -0.0270 -0.0392 0.0291 0.0315 -0.4363 -0.3352 0.1245 0.1853 0.1233 0.1398 0.1067 0.0945 -0.3535
va: 1.8761 3.3527 2.7014 2.0279 3.8971 1.0111 3.8711 1.0278 0.9813 3.8071 3.7809 4.0560 4.0531 1.0572 4.0243 1.0820 1.0810 1.0813 1.0897 1.0795 1.0786 1.0811 1.0781 1.0897 0.9632 1.0474 0.8901 0.4703 3.4743 3.1877 2.4807 0.9729 2.7604 0.9841 3.4552 0.9526 2.5173 3.9378 3.9710 1.0482 1.0153 1.0430 1.0775 1.0678 1.0252 0.9174
dispersion: -0.120214938 hartree
energy: -1295.169604321110 hartree
dipole: 6.946568235 -5.993453896 0.953114338 345.075534893 -347.642560974 -2.567026082 -27.741191330 28.111112859 0.369921529
dipolemethod: SCF
magnitude: 2.763130794 au
magnitude: 7.023320325 debye
