program: Orca
programVersion: 6.1.x
elementType: Au C C C C H C H H C P C C H C H H H H H H H H H H H H C C C C H C H C H H C C H H H
elementType: Au
charge: 1
multiplicity: 1
keywords: wb97x-d3bj def2-TZVPPD def2/J defgrid3 verytightscf
formula: C17H23AuP
InChI: InChI=1/C14H14.C3H9P.Au/c1-4-6-7-12(3)14-10-8-13(5-2)9-11-14;1-4(2)3;/h1,5,8-11H,2-3,6-7H2;1-3H3;/rC17H23AuP/c1-7-16-10-12-17(13-11-16)14(2)8-9-15(3)18-19(4,5)6/h3,7,10-13H,1-2,8-9H2,4-6H3
42 atoms
Au -0.046416 -1.869392 0.146459
C  1.15412 0.337216 1.171984
C  -0.058012 -0.013853 1.151831
C  0.310816 2.531887 2.04148
C  1.541495 2.127091 2.442157
H  1.648862 1.497691 3.31804
C  -1.280717 0.671228 1.635759
H  -1.958252 -0.016193 2.142987
H  -1.809766 1.070019 0.765978
C  -0.87479 1.827198 2.601783
P  -0.183959 -3.891891 -0.921003
C  0.795735 -3.980814 -2.438516
C  0.375432 -5.280451 0.093935
H  2.188593 0.256842 0.892613
C  -1.872201 -4.311354 -1.415574
H  -2.25339 -3.545792 -2.093705
H  -1.883187 -5.281715 -1.91741
H  -2.511032 -4.350796 -0.531471
H  0.457837 -3.211169 -3.134782
H  0.680813 -4.965342 -2.898176
H  1.847509 -3.80849 -2.203202
H  1.420271 -5.130735 0.37178
H  0.276451 -6.214039 -0.464892
H  -0.227853 -5.332926 1.001996
H  2.445487 2.566399 2.035975
H  -1.737209 2.483007 2.717084
H  -0.625968 1.398744 3.572783
C  0.120591 3.498905 0.934177
C  -1.010972 4.312443 0.881817
C  1.068924 3.617908 -0.089858
C  -1.176988 5.228656 -0.147885
H  -1.764131 4.253718 1.65822
C  0.896269 4.523433 -1.119768
H  1.941493 2.974721 -0.094865
C  -0.229428 5.353962 -1.163257
H  -2.059222 5.860699 -0.163711
H  1.64241 4.5751 -1.904226
C  -0.455712 6.345621 -2.234692
C  0.401187 6.673641 -3.19812
H  -1.421459 6.844512 -2.197216
H  0.135697 7.421381 -3.937986
H  1.385044 6.223861 -3.286232
elementType: Au C H P
totalener: -1139.15468945227599 hartree
nucrepener: 1599.77010622210605 hartree
electener: -2738.84450168319972 hartree
oneelecener: -4763.94724647738076 hartree
twoeener: 2025.10274479418104 hartree
cpcmener: -0.07379879307331 hartree
kineticenergy: 1045.08489957066195 hartree
exchangeener: -88.150139980354 hartree
energy: -2098.6192 -281.5105 -281.0664 -280.5754 -280.5230 -280.3737 -280.2838 -280.1934 -280.0985 -280.0398 -280.0388 -279.9336 -279.9292 -279.9160 -279.8382 -279.8337 -279.8329 -279.5975 -182.3862 -132.1231 -132.1230 -132.0913 -116.8501 -67.5633 -67.1570 -67.1384 -28.0115 -27.2306 -25.9070 -25.4022 -25.0765 -24.5139 -24.1601 -23.6052 -23.0053 -23.0019 -21.5762 -21.0088 -20.2937 -19.2124 -18.8606 -18.7681 -18.4431 -17.2418 -16.6770 -16.3791 -16.1634 -15.9202 -15.6539 -15.4631 -15.3629 -15.3002 -15.2665 -14.9242 -14.6246 -14.5613 -14.4375 -14.4295 -14.0711 -13.9430 -13.7618 -13.5401 -13.2349 -13.0158 -12.8862 -12.8094 -12.3830 -12.2845 -12.2317 -12.1126 -11.7981 -11.7715 -11.6898 -11.3561 -10.6988 -10.2265 -10.0743 -9.9595 -8.7294 -0.5119 0.5181 0.9638 1.1796 1.2797 1.5550 1.5657 1.7365 1.9550 2.0037 2.1323 electronvolt
chargesum: 1.0000000
charge: -0.309238 -0.114422 0.231556 -0.078125 -0.227996 0.146079 0.263978 0.134301 0.116599 -0.001420 0.298330 -0.420050 -0.416403 0.017016 -0.419318 0.139904 0.166360 0.141413 0.137708 0.165281 0.141896 0.140183 0.165100 0.138402 0.161157 0.044389 0.150176 0.720350 0.042568 -0.236540 -0.488222 0.006678 -0.400860 0.001151 0.784154 -0.003314 -0.036165 -0.298393 -0.230324 0.043950 0.112043 0.070069
charge: 0.620405 0.177094 -0.319461 -0.175091 0.191654 0.004153 -0.013175 0.018746 0.028989 0.041296 0.725406 -0.019426 -0.019848 -0.014732 -0.019428 -0.044425 -0.035213 -0.044331 -0.044376 -0.035113 -0.044374 -0.044461 -0.035211 -0.044501 0.000698 0.019775 0.033473 -0.135910 0.070621 0.066729 0.056829 0.015038 0.063987 0.015903 -0.183191 0.019655 0.012026 -0.031528 0.183934 0.006560 -0.033711 -0.035466
qa: -0.3092 -0.1144 0.2316 -0.0781 -0.2280 0.1461 0.2640 0.1343 0.1166 -0.0014 0.2983 -0.4201 -0.4164 0.0170 -0.4193 0.1399 0.1664 0.1414 0.1377 0.1653 0.1419 0.1402 0.1651 0.1384 0.1612 0.0444 0.1502 0.7203 0.0426 -0.2365 -0.4882 0.0067 -0.4009 0.0012 0.7842 -0.0033 -0.0362 -0.2984 -0.2303 0.0439 0.1120 0.0701
va: 1.8414 3.4184 2.7359 2.7281 3.7151 1.0235 3.9495 0.9930 1.0077 4.1174 3.7686 4.0427 4.0610 1.0629 4.0353 1.0829 1.0789 1.0810 1.0895 1.0804 1.0773 1.0832 1.0784 1.0889 0.9784 1.0537 0.9338 1.5723 2.9512 2.9705 2.6246 0.9386 3.1341 0.9591 1.1020 0.9964 0.9713 3.1707 3.6845 0.9901 1.0141 0.9796
dispersion: -0.113839842 hartree
energy: -1139.268529294752 hartree
dipole: -0.762378806 0.967783772 0.205404967 266.096209202 -268.270312463 -2.174103261 -24.921226075 25.137998319 0.216772243
dipolemethod: SCF
magnitude: 2.194517349 au
magnitude: 5.578019809 debye
