program: Orca
programVersion: 6.1.x
elementType: C H H C C H C H H C C H H Au P C C C H H H H H H H H H C C C C H C H C H H C C C H H H H H
elementType: Au
charge: 1
multiplicity: 1
keywords: wb97x-d3bj def2-TZVPPD def2/J defgrid3 verytightscf
formula: C18H25AuP
InChI: InChI=1/C15H16.C3H9P.Au/c1-2-4-12(5-3-1)13-6-8-14(9-7-13)15-10-11-15;1-4(2)3;/h2,6-9,15H,3-5,10-11H2;1-3H3;/rC18H25AuP/c1-20(2,3)19-18-12-10-17(11-13-18)16-8-6-15(7-9-16)14-4-5-14/h6-9,12,14H,4-5,10-11,13H2,1-3H3
45 atoms
C  -1.369334 2.188273 -0.140965
H  -2.255768 1.799257 -0.64027
H  -1.229054 3.213793 -0.506925
C  -0.125242 1.397347 -0.48132
C  0.894179 1.573744 0.384878
H  1.788312 0.963531 0.421794
C  0.829124 2.722821 1.436079
H  1.760728 2.791894 1.984733
H  0.525421 3.664165 0.982451
C  -0.236341 1.957855 2.039799
C  -1.565917 2.141325 1.381624
H  -2.25995 1.349233 1.652756
H  -1.975199 3.080854 1.774324
Au -0.026976 0.175968 -2.131067
P  0.07278 -1.192355 -3.989643
C  1.413854 -0.774398 -5.133714
C  0.332655 -2.941406 -3.595389
C  -1.4256 -1.167536 -5.007397
H  -1.608485 -0.150819 -5.360503
H  -1.310868 -1.83537 -5.864411
H  -2.278477 -1.489576 -4.406846
H  1.282625 0.249619 -5.48867
H  1.411501 -1.458171 -5.98591
H  2.370686 -0.845243 -4.612923
H  1.269625 -3.054504 -3.046704
H  0.374174 -3.533478 -4.512681
H  -0.486599 -3.298718 -2.968595
C  -0.038194 1.103059 3.194038
C  -0.880682 0.004986 3.437842
C  0.991297 1.36669 4.110542
C  -0.694654 -0.79788 4.544032
H  -1.666551 -0.243564 2.735785
C  1.160691 0.570018 5.226696
H  1.643788 2.219045 3.968455
C  0.327663 -0.527833 5.462972
H  -1.351671 -1.647143 4.693369
H  1.950456 0.798866 5.93407
C  0.550451 -1.361875 6.666987
C  -0.619142 -1.983167 7.396469
C  0.312504 -2.854399 6.621284
H  1.375815 -1.030929 7.285834
H  -1.606139 -1.802295 6.987123
H  -0.564114 -2.004921 8.478073
H  1.010395 -3.476393 7.168526
H  -0.038705 -3.268662 5.683501
elementType: C H Au P
totalener: -1178.53329451155537 hartree
nucrepener: 1730.92922292658591 hartree
electener: -2909.38426927147066 hartree
oneelecener: -5077.76301949679782 hartree
twoeener: 2168.37875022532717 hartree
cpcmener: -0.06808452740473 hartree
kineticenergy: 1084.13244729391067 hartree
exchangeener: -92.070944799862 hartree
energy: -2098.3153 -282.4528 -280.7082 -280.5528 -280.5353 -280.4131 -280.3998 -280.3828 -280.3298 -280.2225 -280.1117 -280.0393 -280.0170 -279.9689 -279.8109 -279.8032 -279.7162 -279.7140 -279.7103 -182.0940 -131.8338 -131.8333 -131.7891 -116.5088 -67.1919 -66.8033 -66.7795 -28.6467 -27.9923 -27.2265 -25.3668 -25.2251 -24.8695 -24.5204 -23.8689 -22.8701 -22.8666 -21.7840 -21.1337 -20.5088 -20.0454 -19.5486 -19.0622 -18.6683 -18.3528 -17.6250 -17.2166 -16.6099 -16.4287 -16.0296 -15.7476 -15.6785 -15.2332 -15.1624 -15.1600 -15.0720 -14.7508 -14.4822 -14.3285 -14.3132 -14.2719 -14.1142 -14.0734 -13.8241 -13.3374 -13.0522 -13.0153 -12.9059 -12.7449 -12.6754 -12.5774 -12.2130 -12.0171 -11.8583 -11.4347 -11.4166 -11.3637 -11.2751 -10.2571 -10.1899 -10.0379 -9.8269 -8.9683 -1.1871 0.9290 1.1166 1.2523 1.3799 1.5865 1.7943 1.8957 1.9304 2.0678 2.1667 electronvolt
chargesum: 1.0000000
charge: 0.213798 0.139997 0.106316 -0.136727 -0.158596 0.014509 0.647687 0.105587 0.081599 0.554100 -0.039013 0.096390 0.070974 -0.473671 0.301515 -0.433100 -0.430887 -0.421100 0.137263 0.164747 0.134862 0.134659 0.163228 0.138442 0.138130 0.162329 0.134677 0.101275 -0.713135 -0.063516 -0.212812 -0.032349 -0.416174 0.014442 0.661031 0.003499 -0.016346 0.137928 -0.232170 -0.229853 0.080430 0.084927 0.099300 0.101438 0.084369
charge: -0.045650 0.003648 0.029759 -0.283918 -0.030938 0.004559 0.078813 0.025091 0.044485 -0.045113 0.051492 0.017546 0.057590 0.575618 0.716536 -0.025868 -0.025967 -0.025445 -0.046579 -0.037885 -0.046687 -0.046633 -0.037801 -0.046726 -0.046740 -0.037802 -0.046877 -0.126347 0.093976 0.091321 0.075772 0.020310 0.074769 0.020554 -0.117147 0.019013 0.022623 -0.118634 0.073166 0.073007 0.036752 0.007184 0.009090 0.009024 0.007060
qa: 0.2138 0.1400 0.1063 -0.1367 -0.1586 0.0145 0.6477 0.1056 0.0816 0.5541 -0.0390 0.0964 0.0710 -0.4737 0.3015 -0.4331 -0.4309 -0.4211 0.1373 0.1647 0.1349 0.1347 0.1632 0.1384 0.1381 0.1623 0.1347 0.1013 -0.7131 -0.0635 -0.2128 -0.0323 -0.4162 0.0144 0.6610 0.0035 -0.0163 0.1379 -0.2322 -0.2299 0.0804 0.0849 0.0993 0.1014 0.0844
va: 3.7556 0.9642 1.0006 3.2824 3.7915 1.0905 3.0440 0.9603 0.9987 1.9820 4.3172 0.9644 0.9813 1.5566 3.6979 4.0713 4.0661 4.0248 1.0879 1.0828 1.0889 1.0911 1.0827 1.0827 1.0840 1.0827 1.0904 0.9877 3.0964 2.6609 3.1457 1.0335 2.9880 0.9401 1.4159 0.9730 1.0164 2.6307 4.0287 4.0176 0.9395 1.0305 1.0450 1.0454 1.0279
dispersion: -0.116222367 hartree
energy: -1178.649516878412 hartree
dipole: 0.421928602 -0.541342544 -0.119413941 -28.332479958 28.515129916 0.182649959 318.024749544 -317.526674519 0.498075025
dipolemethod: SCF
magnitude: 0.543782519 au
magnitude: 1.382185318 debye
