program: Orca
programVersion: 6.1.x
elementType: C H H C C H C H H C C H H Au P C C C H H H H H H H H H C C C C H C H C H H N C C H H C H H C H H H H
elementType: Au
charge: 1
multiplicity: 1
keywords: wb97x-d3bj def2-TZVPPD def2/J defgrid3 verytightscf
formula: C19H28AuNP
InChI: InChI=1/C16H19N.C3H9P.Au/c1-2-11-17(10-1)15-7-5-13(6-8-15)16-9-3-4-14(16)12-16;1-4(2)3;/h5-8,14H,1-3,9-12H2;1-3H3;/rC19H28AuNP/c1-22(2,3)20-18-10-11-19(14-17(18)19)15-6-8-16(9-7-15)21-12-4-5-13-21/h6-9,17H,4-5,10-14H2,1-3H3
50 atoms
C  0.232466 2.260354 -0.936948
H  -0.673146 2.616636 -1.431553
H  1.058179 2.793872 -1.430481
C  0.44196 0.813743 -1.213861
C  0.941943 0.175633 -0.065531
H  0.967222 -0.897821 0.042276
C  2.181559 0.930761 0.549472
H  2.844855 0.232145 1.043509
H  2.651866 1.676624 -0.0794
C  0.873697 1.181757 1.140704
C  0.199436 2.431879 0.589829
H  -0.833359 2.475559 0.939991
H  0.712134 3.336459 0.921358
Au 0.037592 -0.085701 -2.991555
P  -0.416744 -1.098946 -5.027754
C  -1.600209 -0.180559 -6.043248
C  1.050308 -1.295761 -6.069356
C  -1.114552 -2.761387 -4.871704
H  -2.049469 -2.713034 -4.310266
H  -1.305408 -3.181888 -5.861807
H  -0.412487 -3.400757 -4.333376
H  -2.54564 -0.088466 -5.505415
H  -1.767846 -0.70193 -6.988516
H  -1.209165 0.818869 -6.242687
H  1.488435 -0.316334 -6.270071
H  0.777181 -1.77345 -7.013165
H  1.786008 -1.911569 -5.548785
C  0.527468 0.701852 2.51343
C  0.546864 1.613947 3.570167
C  0.181821 -0.614398 2.805305
C  0.23885 1.235417 4.865484
H  0.806576 2.650808 3.379316
C  -0.125944 -1.016322 4.097193
H  0.144168 -1.356484 2.015379
C  -0.106025 -0.098656 5.164445
H  0.255076 1.980538 5.650989
H  -0.385089 -2.052005 4.277408
N  -0.41973 -0.48011 6.436449
C  -0.792835 -1.843064 6.796179
C  -0.220662 0.374367 7.60425
H  -1.611025 -2.203727 6.166926
H  0.055499 -2.530754 6.675654
C  -1.201032 -1.715952 8.262276
H  0.742972 0.889367 7.553489
H  -1.007034 1.136829 7.669483
C  -0.287638 -0.602671 8.779274
H  -2.247271 -1.40384 8.327758
H  -1.086545 -2.654415 8.806492
H  0.70932 -1.004089 8.981732
H  -0.658045 -0.129099 9.689486
elementType: C H Au P N
totalener: -1273.29881935923913 hartree
nucrepener: 1987.78533227368848 hartree
electener: -3261.00257089692968 hartree
oneelecener: -5717.05511878639027 hartree
twoeener: 2456.05254788946058 hartree
cpcmener: -0.07036997191510 hartree
kineticenergy: 1178.45826616521526 hartree
exchangeener: -100.747134226564 hartree
energy: -2098.4774 -392.5172 -281.8821 -281.0533 -280.8668 -280.7872 -280.6523 -280.2669 -280.2664 -280.1625 -279.9379 -279.8482 -279.8168 -279.8106 -279.8062 -279.7932 -279.7809 -279.5133 -279.4940 -279.4470 -279.4419 -182.2600 -131.9984 -131.9981 -131.9576 -116.9298 -67.6337 -67.2314 -67.1666 -29.8347 -29.1799 -27.1705 -25.6382 -25.3515 -25.1957 -24.2792 -24.0609 -23.5843 -23.1315 -22.9725 -22.9693 -21.3959 -20.7995 -20.3619 -19.3741 -19.2372 -18.8639 -18.6590 -18.5777 -18.0487 -17.4325 -16.8568 -16.3484 -16.0194 -15.7541 -15.5011 -15.3100 -15.2641 -15.2599 -14.8162 -14.7062 -14.6236 -14.5649 -14.4627 -14.4211 -14.4093 -14.2498 -13.9470 -13.9169 -13.8500 -13.6154 -13.3840 -13.1883 -12.8659 -12.7597 -12.4595 -12.3285 -12.2450 -12.2248 -12.0530 -11.9191 -11.8148 -11.7984 -11.7744 -11.6276 -11.2305 -10.6701 -10.2766 -10.1051 -9.7510 -7.6771 -0.8972 0.9936 1.3056 1.3815 1.5108 1.5498 1.7329 1.9173 2.0186 2.1349 2.1903 electronvolt
chargesum: 1.0000000
charge: 0.242942 0.122588 0.111595 0.141129 0.078973 0.071042 -0.118355 0.114027 0.082464 1.552474 -0.477399 0.102982 0.085558 -0.551780 0.274605 -0.425656 -0.426229 -0.424220 0.137821 0.163797 0.140291 0.139504 0.165105 0.139939 0.136468 0.163968 0.139167 0.064580 -0.399888 -0.381720 -0.667069 -0.051126 -0.198063 -0.045161 0.809546 0.025964 0.031090 -0.021819 -0.322522 -0.396444 0.092842 0.166377 -0.216472 0.092181 0.128404 -0.038959 0.125519 0.101600 0.123370 0.094965
charge: -0.023084 0.021536 0.042667 -0.141767 -0.082628 0.021354 0.199930 0.039997 0.034227 -0.260049 0.059819 0.036082 0.034092 0.622187 0.725503 -0.021875 -0.021628 -0.021470 -0.045031 -0.036125 -0.045050 -0.045094 -0.036264 -0.045274 -0.045160 -0.036044 -0.045116 -0.145968 0.049032 0.052011 0.064762 0.022655 0.064538 0.012742 -0.194592 -0.000818 -0.002560 -0.032368 -0.009624 -0.004177 0.028580 0.036728 0.015783 0.026966 0.035112 0.017436 0.022235 0.017208 0.021778 0.016806
qa: 0.2429 0.1226 0.1116 0.1411 0.0790 0.0710 -0.1184 0.1140 0.0825 1.5525 -0.4774 0.1030 0.0856 -0.5518 0.2746 -0.4257 -0.4262 -0.4242 0.1378 0.1638 0.1403 0.1395 0.1651 0.1399 0.1365 0.1640 0.1392 0.0646 -0.3999 -0.3817 -0.6671 -0.0511 -0.1981 -0.0452 0.8095 0.0260 0.0311 -0.0218 -0.3225 -0.3964 0.0928 0.1664 -0.2165 0.0922 0.1284 -0.0390 0.1255 0.1016 0.1234 0.0950
va: 3.7299 1.0273 1.0099 2.8410 3.8147 0.9594 4.1994 0.9867 0.9869 0.8059 4.6257 1.0096 0.9626 1.5418 3.6968 4.0277 4.0766 4.0507 1.0875 1.0806 1.0804 1.0858 1.0822 1.0818 1.0892 1.0788 1.0838 0.1231 3.3090 3.1369 3.2812 1.0202 3.0293 0.9511 1.9541 0.9475 0.9141 2.7145 4.3817 4.3872 1.0663 0.9961 4.1928 1.0689 1.0402 3.9652 1.0071 1.0665 1.0142 1.0754
dispersion: -0.126797925 hartree
energy: -1273.425617284047 hartree
dipole: -5.529860414 5.811727261 0.281866847 -4.980396646 4.832436190 -0.147960456 434.631652900 -437.452326813 -2.820673914
dipolemethod: SCF
magnitude: 2.838581079 au
magnitude: 7.215099710 debye
