program: Orca
programVersion: 6.1.x
elementType: C H H C C H C H H C C H H Au P C C C H H H H H H H H H C C C C H C H C F H N C C H H H H H H
elementType: Au
charge: 1
multiplicity: 1
keywords: wb97x-d3bj def2-TZVPPD def2/J defgrid3 verytightscf
formula: C17H25FAuNP
InChI: InChI=1/C14H16FN.C3H9P.Au/c1-16(2)14-9-8-12(10-13(14)15)11-6-4-3-5-7-11;1-4(2)3;/h4,8-10H,5-7H2,1-2H3;1-3H3;/rC17H25AuFNP/c1-20(2)17-11-8-14(12-16(17)19)13-6-9-15(10-7-13)18-21(3,4)5/h8-9,11-12H,6-7,10H2,1-5H3
46 atoms
C  -1.210847 2.405034 -0.523215
H  -2.098358 2.092841 -1.071679
H  -0.954139 3.410123 -0.88303
C  -0.029711 1.49845 -0.776059
C  0.939352 1.606087 0.168568
H  1.753955 0.902629 0.285498
C  0.958941 2.808507 1.147948
H  1.874887 2.820655 1.725018
H  0.726715 3.753112 0.6638
C  -0.15993 2.065617 1.669047
C  -1.46728 2.374995 0.989027
H  -2.222586 1.628422 1.224034
H  -1.819489 3.335725 1.380297
Au 0.052207 0.190056 -2.353321
P  0.135658 -1.283704 -4.132448
C  0.885855 -0.584195 -5.62543
C  1.092829 -2.783444 -3.792797
C  -1.487675 -1.88241 -4.66795
H  -2.105919 -1.03511 -4.970632
H  -1.377733 -2.571543 -5.508583
H  -1.977287 -2.395943 -3.838308
H  0.311635 0.286962 -5.946583
H  0.896917 -1.328221 -6.425467
H  1.908022 -0.270022 -5.406032
H  2.118703 -2.509719 -3.539114
H  1.096291 -3.436326 -4.668792
H  0.651124 -3.312823 -2.946432
C  -0.059832 1.190005 2.821502
C  -0.991032 0.15736 3.029378
C  0.950821 1.348363 3.778281
C  -0.882494 -0.662453 4.116292
H  -1.807713 -0.022596 2.341521
C  1.04546 0.51725 4.875302
H  1.675845 2.146294 3.67737
C  0.143801 -0.548532 5.084129
F  -1.851443 -1.599354 4.293888
H  1.846776 0.6784 5.582908
N  0.232876 -1.377645 6.160091
C  -0.180881 -2.780523 6.087313
C  1.1616 -1.059747 7.233846
H  0.556145 -3.380613 6.62363
H  -1.160754 -2.941127 6.544072
H  -0.20449 -3.128805 5.056268
H  0.887797 -1.651718 8.107237
H  2.200572 -1.290277 6.966457
H  1.088271 -0.005939 7.505354
elementType: C H Au P F N
totalener: -1295.08498833173917 hartree
nucrepener: 1935.34780290343519 hartree
electener: -3230.35718247572004 hartree
oneelecener: -5647.77823499974784 hartree
twoeener: 2417.42105252402780 hartree
cpcmener: -0.06771835200986 hartree
kineticenergy: 1200.34128990241720 hartree
exchangeener: -100.288577686020 hartree
energy: -2098.3372 -674.4605 -393.2105 -282.2149 -282.1874 -281.6508 -280.5873 -280.5420 -280.4770 -280.3904 -280.3570 -280.3325 -280.3157 -280.3096 -280.1471 -279.9846 -279.9502 -279.7273 -279.7271 -279.7252 -182.1168 -131.8563 -131.8560 -131.8122 -116.5699 -67.2564 -66.8654 -66.8350 -37.2667 -30.0980 -28.7272 -27.5137 -25.3189 -25.2388 -24.8914 -24.5447 -23.8704 -23.3954 -22.8834 -22.8813 -22.2357 -21.2925 -20.6207 -20.1664 -19.3349 -18.7057 -18.5213 -17.8816 -17.4231 -17.3498 -17.1158 -16.6696 -16.3272 -15.9275 -15.8311 -15.5566 -15.3856 -15.1831 -15.1767 -15.1678 -15.0737 -14.4865 -14.3993 -14.3394 -14.3250 -14.2994 -14.1538 -14.0206 -13.8366 -13.8005 -13.5716 -13.3455 -13.2757 -13.0421 -12.7398 -12.6564 -12.5599 -12.2479 -11.9552 -11.5481 -11.4830 -11.4741 -11.4142 -10.1793 -10.0670 -10.0555 -9.7193 -8.1095 -0.9419 1.0185 1.1334 1.3462 1.3840 1.5516 1.6951 1.8533 1.9950 2.1336 2.2375 electronvolt
chargesum: 1.0000000
charge: 0.254572 0.137533 0.107805 -0.171318 -0.080162 0.019167 0.446224 0.083913 0.070582 0.948695 -0.167525 0.089544 0.060905 -0.448374 0.318015 -0.424391 -0.433023 -0.429988 0.137422 0.163757 0.134754 0.137081 0.162828 0.135563 0.138538 0.162136 0.136717 -0.023550 -0.449744 -0.568606 0.386400 -0.057292 0.018372 -0.004854 0.215141 -0.345032 0.031399 0.070188 -0.293035 -0.477982 0.168042 0.083105 0.090484 0.167813 0.173306 0.124873
charge: -0.040722 0.004501 0.031044 -0.257599 -0.040064 0.012792 0.097640 0.026629 0.043474 -0.092271 0.053128 0.016946 0.050906 0.583427 0.718026 -0.024968 -0.025273 -0.025170 -0.046351 -0.037587 -0.046560 -0.046349 -0.037544 -0.046430 -0.046483 -0.037555 -0.046614 -0.136634 0.132658 0.078488 -0.170848 0.032594 0.088013 0.020600 -0.138583 0.051880 0.005528 -0.074619 0.167118 0.148393 0.007974 0.008810 0.003503 0.010282 0.016947 0.006926
qa: 0.2546 0.1375 0.1078 -0.1713 -0.0802 0.0192 0.4462 0.0839 0.0706 0.9487 -0.1675 0.0895 0.0609 -0.4484 0.3180 -0.4244 -0.4330 -0.4300 0.1374 0.1638 0.1348 0.1371 0.1628 0.1356 0.1385 0.1621 0.1367 -0.0236 -0.4497 -0.5686 0.3864 -0.0573 0.0184 -0.0049 0.2151 -0.3450 0.0314 0.0702 -0.2930 -0.4780 0.1680 0.0831 0.0905 0.1678 0.1733 0.1249
va: 3.6486 0.9688 0.9987 3.3074 3.8382 1.0966 3.4615 0.9691 0.9960 1.4676 4.4157 0.9689 0.9925 1.6046 3.7016 4.0628 4.0525 4.0486 1.0853 1.0822 1.0916 1.0879 1.0818 1.0880 1.0821 1.0821 1.0863 0.5288 3.1611 3.1200 2.0267 1.0072 2.8526 0.9448 3.3315 0.9152 0.9551 2.9000 3.9105 3.9887 0.9697 1.1217 1.0387 0.9851 1.0435 1.0293
dispersion: -0.116986491 hartree
energy: -1295.201974822602 hartree
dipole: -3.924150633 4.780316155 0.856165522 -31.565784142 31.673346569 0.107562427 337.446131113 -337.180593374 0.265537739
dipolemethod: SCF
magnitude: 0.902828538 au
magnitude: 2.294807771 debye
