program: Orca
programVersion: 6.1.x
elementType: Au C C C C H C H H C P C C H C H H H H H H H H H H H H C C C C H C H C F F F
elementType: Au
charge: 1
multiplicity: 1
keywords: wb97x-d3bj def2-TZVPPD def2/J defgrid3 verytightscf
formula: C15H18F3AuP
InChI: InChI=1/C12H9F3.C3H9P.Au/c13-10-6-9(7-11(14)12(10)15)8-4-2-1-3-5-8;1-4(2)3;/h2,6-7H,3-5H2;1-3H3;/rC15H18AuF3P/c1-20(2,3)16-12-6-4-10(5-7-12)11-8-13(17)15(19)14(18)9-11/h6,8-9H,4-5,7H2,1-3H3
38 atoms
Au 0.030659 -2.133473 0.200606
C  1.569537 0.298892 0.999532
C  0.373442 -0.283636 1.05826
C  0.653745 2.359153 1.66791
C  1.931315 1.658612 1.684715
H  2.268667 1.466071 2.704299
C  -0.779989 0.406618 1.718424
H  -1.291198 -0.245999 2.428918
H  -1.512929 0.691271 0.957583
C  -0.362195 1.71706 2.497445
P  -0.352863 -4.196035 -0.759508
C  0.518808 -4.452863 -2.32733
C  0.14517 -5.598659 0.27416
H  2.406771 -0.118057 0.449099
C  -2.093752 -4.514196 -1.150109
H  -2.455619 -3.752834 -1.843804
H  -2.206131 -5.501997 -1.603284
H  -2.686774 -4.46482 -0.23482
H  0.206155 -3.692526 -3.045681
H  0.295105 -5.444808 -2.726963
H  1.594426 -4.360481 -2.164955
H  1.213405 -5.53091 0.488944
H  -0.063719 -6.540346 -0.239089
H  -0.404507 -5.568764 1.216927
H  2.721984 2.134266 1.112716
H  -1.239528 2.327419 2.692155
H  0.092363 1.402828 3.4374
C  0.352701 3.425034 0.754111
C  -0.988755 3.767999 0.496387
C  1.388964 4.118405 0.101229
C  -1.267901 4.759349 -0.409094
H  -1.817012 3.25738 0.968451
C  1.07571 5.122329 -0.780263
H  2.433002 3.909374 0.288388
C  -0.247135 5.44997 -1.052881
F  -2.531124 5.095144 -0.693585
F  -0.532666 6.415654 -1.91089
F  2.036475 5.814266 -1.402908
elementType: Au C H P F
totalener: -1359.55554925548586 hartree
nucrepener: 1789.26154408156549 hartree
electener: -3148.73304682701564 hartree
oneelecener: -5452.43894034752157 hartree
twoeener: 2303.70589352050592 hartree
cpcmener: -0.07934877110425 hartree
kineticenergy: 1264.90804230939648 hartree
exchangeener: -101.745801053335 hartree
energy: -2098.2752 -675.6848 -675.2669 -675.2606 -283.6773 -283.2528 -283.2474 -282.9631 -281.4767 -281.2460 -281.2421 -280.5357 -280.4576 -280.3403 -280.0867 -279.7493 -279.6910 -279.6894 -279.6882 -182.0517 -131.7920 -131.7915 -131.7464 -116.3789 -67.0549 -66.6706 -66.6647 -38.7867 -38.1621 -38.0330 -29.1745 -28.0335 -25.9131 -25.6553 -25.1980 -24.7590 -24.3365 -22.8431 -22.8422 -22.3277 -22.1494 -21.1399 -20.3382 -19.7505 -19.2608 -18.9062 -18.6151 -18.0897 -18.0102 -17.8592 -17.1560 -16.9623 -16.6460 -16.5738 -16.1337 -15.8920 -15.7134 -15.6502 -15.3750 -15.1401 -15.1376 -15.0550 -14.5988 -14.4308 -14.2978 -14.2861 -14.1970 -14.1283 -13.8152 -13.8014 -13.5671 -13.1695 -12.6453 -12.5955 -12.3422 -11.7595 -11.3417 -11.3069 -11.2845 -10.8964 -10.5965 -9.9542 -9.6372 -9.2674 -2.0743 0.8936 0.9583 1.0965 1.1486 1.4565 1.6218 1.7501 1.8284 2.1048 2.2272 electronvolt
chargesum: 1.0000000
charge: -0.438017 -0.203502 -0.156272 0.705040 0.360374 0.121443 0.244608 0.074445 0.124263 -0.023430 0.302410 -0.429886 -0.421165 0.042793 -0.425315 0.135713 0.163924 0.136788 0.135090 0.163187 0.139391 0.136324 0.163404 0.134081 0.032859 0.044480 0.190529 0.212058 -0.593591 -0.576812 0.410253 -0.021947 0.545400 -0.036785 0.460993 -0.299356 -0.258365 -0.295407
charge: 0.567399 -0.035139 -0.340813 0.014799 0.059783 0.046121 -0.036115 0.010282 0.015108 0.074729 0.714893 -0.026968 -0.027083 -0.017359 -0.026994 -0.047367 -0.038345 -0.047160 -0.047259 -0.038367 -0.047007 -0.047111 -0.038330 -0.047165 0.017032 0.027411 0.048978 -0.085873 0.179674 0.180838 -0.157590 0.041610 -0.158448 0.040193 -0.104228 0.111523 0.153097 0.111250
qa: -0.4380 -0.2035 -0.1563 0.7050 0.3604 0.1214 0.2446 0.0744 0.1243 -0.0234 0.3024 -0.4299 -0.4212 0.0428 -0.4253 0.1357 0.1639 0.1368 0.1351 0.1632 0.1394 0.1363 0.1634 0.1341 0.0329 0.0445 0.1905 0.2121 -0.5936 -0.5768 0.4103 -0.0219 0.5454 -0.0368 0.4610 -0.2994 -0.2584 -0.2954
va: 1.6930 3.3762 2.6747 2.2910 3.8485 0.9249 3.8018 1.1072 1.0528 3.9314 3.6773 4.0545 4.0626 0.9838 4.0395 1.0889 1.0818 1.0870 1.0907 1.0835 1.0812 1.0881 1.0825 1.0915 0.9908 1.0652 0.8736 1.7619 3.9470 3.9069 3.2079 1.0090 2.9799 1.0100 3.3717 1.0496 1.0934 1.0484
dispersion: -0.104175954 hartree
energy: -1359.659725209974 hartree
dipole: -3.069987066 3.320829345 0.250842279 270.459565612 -270.640823318 -0.181257705 -17.941396844 19.422648722 1.481251878
dipolemethod: SCF
magnitude: 1.513236046 au
magnitude: 3.846340355 debye
