program: Orca
programVersion: 6.1.x
elementType: Au C C C C H C H H C P C C H C H H H H H H H H H H H H C C C C H C H C N O O C N C N
elementType: Au
charge: 1
multiplicity: 1
keywords: wb97x-d3bj def2-TZVPPD def2/J defgrid3 verytightscf
formula: C17H18AuN3O2P
InChI: InChI=1/C14H9N3O2.C3H9P.Au/c15-8-12-6-11(10-4-2-1-3-5-10)7-13(9-16)14(12)17(18)19;1-4(2)3;/h2,6-7H,3-5H2;1-3H3;/rC17H18AuN3O2P/c1-24(2,3)18-16-6-4-12(5-7-16)13-8-14(10-19)17(21(22)23)15(9-13)11-20/h6,8-9H,4-5,7H2,1-3H3
42 atoms
Au 0.07259 -2.718236 0.173119
C  1.807396 -0.39321 0.902814
C  0.613828 -0.944161 1.09225
C  1.062961 1.597275 1.907946
C  2.300354 0.882327 1.681789
H  2.751082 0.559114 2.620466
C  -0.413744 -0.285465 1.946762
H  -0.87069 -0.971308 2.662182
H  -1.21149 0.116884 1.317357
C  0.15901 0.939669 2.821517
P  -0.555823 -4.689241 -0.845025
C  -0.493856 -4.63623 -2.654679
C  0.464608 -6.11542 -0.390871
H  2.546426 -0.753133 0.195061
C  -2.25197 -5.195147 -0.458189
H  -2.945988 -4.417318 -0.782422
H  -2.492377 -6.132061 -0.966267
H  -2.354515 -5.329787 0.62029
H  -1.154506 -3.846786 -3.018101
H  -0.809425 -5.595514 -3.071757
H  0.525613 -4.417282 -2.977914
H  1.50247 -5.923663 -0.669884
H  0.109585 -7.012454 -0.903781
H  0.413911 -6.269609 0.688664
H  3.03307 1.413899 1.08151
H  -0.693945 1.523698 3.154479
H  0.699603 0.500722 3.658217
C  0.646498 2.72128 1.074514
C  -0.408206 3.542472 1.476594
C  1.2979 2.984802 -0.134426
C  -0.799344 4.624656 0.694658
H  -0.923523 3.378198 2.412577
C  0.888908 4.038071 -0.94073
H  2.112884 2.363357 -0.480044
C  -0.151413 4.856399 -0.511224
N  -0.568137 5.994948 -1.351613
O  -0.734023 5.770799 -2.530153
O  -0.710375 7.061067 -0.79518
C  -1.892359 5.444243 1.151156
N  -2.777785 6.055464 1.550187
C  1.589275 4.27302 -2.177635
N  2.189494 4.425993 -3.143636
elementType: Au C H P N O
totalener: -1450.89839852738305 hartree
nucrepener: 2185.46596855893813 hartree
electener: -3636.24697332111600 hartree
oneelecener: -6350.09926574580732 hartree
twoeener: 2713.85229242469131 hartree
cpcmener: -0.11470728053414 hartree
kineticenergy: 1355.77466604126903 hartree
exchangeener: -112.591724688302 hartree
energy: -2098.3522 -525.1221 -525.1211 -400.2011 -393.2207 -393.2153 -283.4451 -283.2709 -282.6364 -282.6331 -281.9934 -281.9878 -281.9591 -281.7671 -281.7635 -280.7593 -280.7459 -280.6992 -280.3641 -279.9795 -279.7361 -279.7347 -279.7335 -182.1279 -131.8677 -131.8671 -131.8241 -116.4948 -67.1762 -66.7878 -66.7813 -38.8267 -33.9502 -30.2562 -29.5354 -29.2854 -28.6633 -27.1347 -26.9144 -25.2931 -25.2328 -25.0292 -24.1147 -23.0227 -22.8907 -22.8899 -22.0047 -21.4612 -21.2976 -19.9157 -19.6353 -19.1097 -18.7300 -18.6797 -18.2538 -18.1334 -17.9240 -17.4406 -16.4437 -16.2651 -15.9518 -15.7797 -15.6669 -15.3248 -15.1889 -15.1840 -15.0456 -14.8352 -14.4594 -14.3376 -14.3356 -14.3066 -14.1928 -14.0516 -13.9754 -13.8461 -13.7284 -13.5485 -13.3492 -13.2476 -12.7320 -12.6956 -12.6807 -12.6461 -12.5575 -12.4653 -11.8946 -11.5960 -11.4573 -11.4210 -11.3982 -11.1354 -10.0362 -9.8618 -9.4675 -2.5554 -0.8444 -0.7789 0.4736 0.8869 1.0727 1.1196 1.5132 1.6493 1.7128 1.9426 electronvolt
chargesum: 1.0000000
charge: -0.415292 -0.191401 -0.153951 0.523792 0.184957 0.155744 0.235952 0.109761 0.143024 0.144017 0.293501 -0.423756 -0.426135 0.035931 -0.420859 0.137114 0.163614 0.137458 0.134436 0.163749 0.138259 0.137996 0.163349 0.134842 0.070820 0.003688 0.166368 0.893707 -0.222833 -0.300218 0.572262 -0.016689 0.338707 -0.025909 0.166880 0.884758 -0.466854 -0.466750 -0.562967 -0.272109 -0.590102 -0.278863
charge: 0.576191 -0.020882 -0.333680 0.015740 0.063166 0.047417 -0.010426 0.012906 0.022431 0.099582 0.716605 -0.025746 -0.025556 -0.009639 -0.025738 -0.046864 -0.037702 -0.046806 -0.046818 -0.037667 -0.046514 -0.046538 -0.037682 -0.046736 0.027296 0.028054 0.050466 -0.047246 0.186631 0.185847 -0.080155 0.046359 -0.079236 0.048636 -0.011991 -0.324022 0.111349 0.112060 -0.142996 0.161584 -0.143127 0.161448
qa: -0.4153 -0.1914 -0.1540 0.5238 0.1850 0.1557 0.2360 0.1098 0.1430 0.1440 0.2935 -0.4238 -0.4261 0.0359 -0.4209 0.1371 0.1636 0.1375 0.1344 0.1637 0.1383 0.1380 0.1633 0.1348 0.0708 0.0037 0.1664 0.8937 -0.2228 -0.3002 0.5723 -0.0167 0.3387 -0.0259 0.1669 0.8848 -0.4669 -0.4668 -0.5630 -0.2721 -0.5901 -0.2789
va: 1.6955 3.3930 2.6647 2.6128 3.6455 0.8887 3.7606 1.0561 1.0418 4.3656 3.6878 4.0596 4.0658 0.9974 4.0296 1.0863 1.0823 1.0857 1.0920 1.0815 1.0835 1.0840 1.0829 1.0909 0.9962 1.0611 0.9135 0.7395 2.2148 1.9528 2.1351 0.9641 2.2787 1.0067 4.1324 3.9785 1.8098 1.8089 2.4063 2.3979 2.3408 2.3878
dispersion: -0.121575331 hartree
energy: -1451.019973857891 hartree
dipole: -7.361177641 8.586728459 1.225550818 357.264222707 -361.326564738 -4.062342032 -17.804459638 21.057241633 3.252781996
dipolemethod: SCF
magnitude: 5.346511788 au
magnitude: 13.589752970 debye
