program: Orca
programVersion: 6.1.x
elementType: Au C C C C H C H H C P C C H C H H H H H H H H H H H H C C C C H C H C C C N F F F F F F O O
elementType: Au
charge: 1
multiplicity: 1
keywords: wb97x-d3bj def2-TZVPPD def2/J defgrid3 verytightscf
formula: C17H18F6AuNO2P
InChI: InChI=1/C14H9F6NO2.C3H9P.Au/c15-13(16,17)10-6-9(8-4-2-1-3-5-8)7-11(14(18,19)20)12(10)21(22)23;1-4(2)3;/h2,6-7H,3-5H2;1-3H3;/rC17H18AuF6NO2P/c1-28(2,3)18-12-6-4-10(5-7-12)11-8-13(16(19,20)21)15(25(26)27)14(9-11)17(22,23)24/h6,8-9H,4-5,7H2,1-3H3
46 atoms
Au -0.063914 -3.370935 -0.265345
C  -2.06176 -1.149663 -0.302793
C  -0.995435 -1.644805 -0.924024
C  -1.824347 0.876443 -1.469642
C  -2.861271 0.098417 -0.81983
H  -3.610562 -0.238136 -1.536653
C  -0.396283 -0.943314 -2.097829
H  -0.21318 -1.616719 -2.937122
H  0.564137 -0.506162 -1.811171
C  -1.305863 0.245434 -2.66747
P  0.987169 -5.285883 0.474059
C  1.322896 -5.297735 2.25454
C  0.050177 -6.807317 0.174804
H  -2.467103 -1.545722 0.622208
C  2.599506 -5.5813 -0.297761
H  3.262134 -4.739132 -0.089227
H  3.043773 -6.499337 0.094074
H  2.474623 -5.670415 -1.378641
H  1.961941 -4.450205 2.509763
H  1.820843 -6.227638 2.539374
H  0.38312 -5.206179 2.802457
H  -0.913236 -6.747076 0.684721
H  0.605133 -7.672076 0.546344
H  -0.126183 -6.921362 -0.896486
H  -3.349204 0.58352 0.019845
H  -0.686595 0.867953 -3.305805
H  -2.11285 -0.214793 -3.235249
C  -1.169703 2.009718 -0.835045
C  -1.51089 2.392451 0.467528
C  -0.168856 2.717991 -1.508044
C  -0.865405 3.443631 1.09022
H  -2.273298 1.860302 1.017059
C  0.482276 3.778344 -0.902097
H  0.104875 2.458029 -2.519788
C  0.126369 4.126405 0.394315
C  -1.27189 3.817937 2.50488
C  1.566832 4.509118 -1.673916
N  0.81998 5.25884 1.053749
F  -1.875408 2.792174 3.121079
F  -2.129267 4.851166 2.516522
F  -0.210061 4.164889 3.253534
F  1.421487 4.334168 -2.994775
F  2.790749 4.065651 -1.344422
F  1.539768 5.833143 -1.441833
O  0.166846 6.259466 1.241442
O  1.980365 5.085926 1.348664
elementType: Au C H P N F O
totalener: -1940.74543362124427 hartree
nucrepener: 3130.29485304779018 hartree
electener: -5070.94115718985358 hartree
oneelecener: -8922.73472433708412 hartree
twoeener: 3851.79356714723053 hartree
cpcmener: -0.09516781003141 hartree
kineticenergy: 1844.14551643573077 hartree
exchangeener: -146.438212469834 hartree
energy: -2098.3260 -675.5754 -675.5733 -675.5670 -675.5639 -675.4640 -675.4573 -525.0930 -525.0920 -400.1323 -287.5576 -287.5530 -283.3536 -283.1977 -282.0966 -282.0925 -281.7979 -281.7869 -281.7748 -280.6729 -280.6668 -280.5915 -280.2786 -279.9107 -279.7207 -279.7184 -279.7175 -182.1020 -131.8419 -131.8414 -131.7977 -116.4566 -67.1363 -66.7490 -66.7429 -40.3449 -40.3377 -38.8033 -37.8737 -37.8607 -37.7826 -37.7770 -33.9235 -29.9111 -28.6161 -27.0880 -27.0129 -25.2666 -25.2156 -24.9829 -24.4673 -23.7876 -23.3527 -22.8745 -22.8721 -22.2166 -21.6776 -21.3155 -21.0830 -20.4301 -20.3073 -20.2745 -20.2395 -19.8391 -19.4561 -19.1216 -19.0546 -18.6603 -18.5193 -18.3853 -17.6741 -17.3638 -16.9015 -16.8803 -16.8154 -16.6950 -16.3344 -16.0706 -15.9952 -15.8138 -15.7805 -15.7720 -15.6720 -15.6007 -15.4306 -15.3067 -15.1806 -15.1774 -15.1692 -15.1638 -15.1055 -14.8633 -14.6660 -14.3258 -14.3149 -14.1577 -13.8981 -13.8302 -13.7902 -13.4106 -12.8347 -12.6970 -12.6814 -12.6404 -12.5728 -12.4853 -11.8521 -11.5524 -11.5247 -11.4201 -11.3810 -11.3610 -10.0095 -9.7897 -9.4124 -2.4130 -0.6294 -0.1783 0.8006 0.9555 1.0883 1.1762 1.5255 1.6218 1.6378 1.8452 electronvolt
chargesum: 1.0000000
charge: -0.418371 -0.196659 -0.139773 0.548695 0.224510 0.155450 0.297698 0.092965 0.122343 0.191455 0.294700 -0.426664 -0.428435 0.045268 -0.424096 0.137275 0.164094 0.136703 0.134901 0.163669 0.138513 0.138189 0.163103 0.135679 0.034894 -0.042099 0.186684 0.217948 -0.389867 -0.319426 0.070156 0.046186 -0.008997 0.111024 -0.092308 0.680965 0.708833 0.999842 -0.249173 -0.227555 -0.242007 -0.250502 -0.229635 -0.241717 -0.506571 -0.507883
charge: 0.573260 -0.023193 -0.335193 0.023698 0.062520 0.046231 -0.016806 0.012499 0.020941 0.093394 0.716003 -0.026160 -0.026164 -0.011859 -0.026062 -0.046936 -0.037943 -0.046839 -0.046958 -0.037878 -0.046771 -0.046700 -0.037907 -0.046893 0.022321 0.025948 0.049041 -0.041672 0.195278 0.194761 0.020982 0.037538 0.020921 0.036775 0.012129 -0.554901 -0.554739 -0.354561 0.157622 0.158635 0.157129 0.157720 0.158498 0.157447 0.127628 0.127216
qa: -0.4184 -0.1967 -0.1398 0.5487 0.2245 0.1555 0.2977 0.0930 0.1223 0.1915 0.2947 -0.4267 -0.4284 0.0453 -0.4241 0.1373 0.1641 0.1367 0.1349 0.1637 0.1385 0.1382 0.1631 0.1357 0.0349 -0.0421 0.1867 0.2179 -0.3899 -0.3194 0.0702 0.0462 -0.0090 0.1110 -0.0923 0.6810 0.7088 0.9998 -0.2492 -0.2276 -0.2420 -0.2505 -0.2296 -0.2417 -0.5066 -0.5079
va: 1.7014 3.4086 2.6815 2.6346 3.6664 0.8900 3.7169 1.0619 1.0650 4.1841 3.6827 4.0558 4.0678 0.9880 4.0346 1.0864 1.0824 1.0861 1.0919 1.0825 1.0824 1.0854 1.0833 1.0902 0.9894 1.0776 0.8727 1.5943 2.0475 2.1253 2.6514 0.7079 2.7690 0.5035 4.3274 3.3435 3.3257 4.0980 0.9702 0.9989 0.9445 0.9662 1.0018 0.9368 1.7810 1.7822
dispersion: -0.125697177 hartree
energy: -1940.871130798621 hartree
dipole: 4.050882914 -6.036555784 -1.985672870 425.516228096 -430.002931837 -4.486703741 28.122877280 -30.505003292 -2.382126012
dipolemethod: SCF
magnitude: 5.454166439 au
magnitude: 13.863389346 debye
