program: Orca
programVersion: 6.1.x
elementType: Au C C C C H C H H C P C C H C H H H H H H H H H H H H C C C C H C H C H H C F F F
elementType: Au
charge: 1
multiplicity: 1
keywords: wb97x-d3bj def2-TZVPPD def2/J defgrid3 verytightscf
formula: C16H20F3AuP
InChI: InChI=1/C13H11F3.C3H9P.Au/c14-13(15,16)12-8-6-11(7-9-12)10-4-2-1-3-5-10;1-4(2)3;/h2,6-9H,3-5H2;1-3H3;/rC16H20AuF3P/c1-21(2,3)17-15-10-6-13(7-11-15)12-4-8-14(9-5-12)16(18,19)20/h4-5,8-10H,6-7,11H2,1-3H3
41 atoms
Au -0.03757 -2.508167 0.154043
C  1.27891 -0.226098 1.561123
C  0.099325 -0.757822 1.245896
C  0.253351 1.800995 2.168492
C  1.469475 1.049309 2.448235
H  1.520985 0.748481 3.495721
C  -1.17413 -0.078341 1.645142
H  -1.871349 -0.769338 2.123221
H  -1.670009 0.313755 0.75223
C  -0.952358 1.128918 2.643591
P  -0.19609 -4.455424 -1.073087
C  1.396143 -5.094252 -1.656774
C  -0.940939 -5.84015 -0.172102
H  2.224367 -0.62868 1.211979
C  -1.201069 -4.295713 -2.572713
H  -0.766987 -3.532546 -3.221554
H  -1.240328 -5.247919 -3.107068
H  -2.213129 -3.98998 -2.300473
H  1.879639 -4.344782 -2.286377
H  1.249274 -6.011905 -2.231281
H  2.040657 -5.300855 -0.800177
H  -0.341747 -6.06264 0.712936
H  -0.98974 -6.725577 -0.810413
H  -1.948447 -5.565935 0.146664
H  2.390855 1.542649 2.154978
H  -1.84119 1.7528 2.668035
H  -0.762814 0.701389 3.628456
C  0.215891 2.95341 1.305969
C  -1.009352 3.395057 0.76869
C  1.393973 3.644176 0.975416
C  -1.04728 4.475116 -0.087276
H  -1.930862 2.881062 1.004675
C  1.35308 4.740653 0.132878
H  2.345482 3.343163 1.390813
C  0.135181 5.143818 -0.396387
H  -1.98895 4.803629 -0.511014
H  2.263307 5.273893 -0.107513
C  0.056329 6.32931 -1.331924
F  -0.401903 5.96069 -2.5455
F  -0.790057 7.267517 -0.862927
F  1.245031 6.922776 -1.519441
elementType: Au C H P F
totalener: -1398.94277996246137 hartree
nucrepener: 1909.33177414003785 hartree
electener: -3308.19050233753342 hartree
oneelecener: -5744.63957429465427 hartree
twoeener: 2436.44907195712085 hartree
cpcmener: -0.07804106987624 hartree
kineticenergy: 1304.08669647602756 hartree
exchangeener: -105.622993175690 hartree
energy: -2098.2715 -675.2970 -675.2272 -675.2213 -287.0852 -282.8989 -281.4659 -281.1613 -280.9984 -280.9710 -280.7353 -280.7340 -280.4902 -280.4234 -280.3348 -280.0738 -279.7343 -279.6876 -279.6869 -279.6867 -182.0481 -131.7882 -131.7880 -131.7427 -116.3716 -67.0476 -66.6631 -66.6575 -39.9881 -37.5441 -37.4560 -28.9087 -27.9666 -26.1225 -25.3465 -25.1953 -24.7277 -24.5415 -23.3011 -22.8413 -22.8399 -21.7023 -21.5320 -20.8717 -19.9573 -19.8500 -19.8065 -19.5206 -18.6359 -18.4202 -17.2388 -16.9939 -16.6133 -16.5783 -16.3756 -16.0126 -15.8200 -15.6555 -15.6245 -15.5698 -15.5074 -15.1405 -15.1359 -15.1156 -14.9083 -14.8591 -14.6853 -14.4207 -14.2878 -14.2848 -13.9827 -13.7991 -13.7045 -13.4679 -13.3167 -13.0899 -12.6392 -12.5876 -12.2641 -11.7434 -11.3293 -11.3123 -11.2834 -11.1825 -10.6657 -9.9488 -9.6211 -9.2718 -2.0664 0.8228 0.9604 1.1470 1.2462 1.4395 1.5832 1.7315 1.8703 2.0951 2.1988 electronvolt
chargesum: 1.0000000
charge: -0.453172 -0.240378 -0.109864 0.643250 0.324904 0.129332 0.246562 0.066904 0.131069 0.013625 0.311869 -0.424520 -0.425684 0.036475 -0.431689 0.133559 0.165332 0.136610 0.137098 0.164166 0.136299 0.132577 0.164839 0.137214 0.035146 0.053375 0.191462 0.257197 -0.202262 -0.181352 -0.810116 -0.000244 -0.073465 -0.012978 0.704720 -0.036739 0.039252 0.635211 -0.234828 -0.237446 -0.253312
charge: 0.567041 -0.035296 -0.341209 0.016801 0.058192 0.045253 -0.035638 0.010065 0.015174 0.073723 0.714872 -0.026595 -0.027125 -0.017452 -0.027489 -0.047326 -0.038344 -0.047420 -0.047159 -0.038345 -0.047066 -0.047125 -0.038346 -0.047239 0.015403 0.025574 0.048002 -0.089237 0.126990 0.131175 0.106447 0.025242 0.112674 0.024510 -0.051678 0.038918 0.030983 -0.566837 0.143440 0.143711 0.142737
qa: -0.4532 -0.2404 -0.1099 0.6432 0.3249 0.1293 0.2466 0.0669 0.1311 0.0136 0.3119 -0.4245 -0.4257 0.0365 -0.4317 0.1336 0.1653 0.1366 0.1371 0.1642 0.1363 0.1326 0.1648 0.1372 0.0351 0.0534 0.1915 0.2572 -0.2023 -0.1814 -0.8101 -0.0002 -0.0735 -0.0130 0.7047 -0.0367 0.0393 0.6352 -0.2348 -0.2374 -0.2533
va: 1.6863 3.4791 2.6774 2.3372 3.8873 0.9200 3.7865 1.1174 1.0501 3.9060 3.6629 4.0318 4.0580 0.9923 4.0633 1.0935 1.0812 1.0875 1.0856 1.0829 1.0868 1.0950 1.0816 1.0863 0.9877 1.0501 0.8742 1.7598 2.8194 2.8586 3.2144 0.9861 2.5142 0.9725 2.4086 1.0811 0.9698 3.1143 1.0111 1.0117 1.0027
dispersion: -0.109891993 hartree
energy: -1399.052671955493 hartree
dipole: 4.703076668 -4.778443206 -0.075366537 321.361711223 -322.153108461 -0.791397238 -10.749648516 12.430252052 1.680603536
dipolemethod: SCF
magnitude: 1.859144413 au
magnitude: 4.725569551 debye
