program: Orca
programVersion: 6.1.x
elementType: Au C C C C H C H H C P C C H C H H H H H H H H H H H H C C C C H C H C H H C N
elementType: Au
charge: 1
multiplicity: 1
keywords: wb97x-d3bj def2-TZVPPD def2/J defgrid3 verytightscf
formula: C16H20AuNP
InChI: InChI=1/C13H11N.C3H9P.Au/c14-10-11-6-8-13(9-7-11)12-4-2-1-3-5-12;1-4(2)3;/h2,6-9H,3-5H2;1-3H3;/rC16H20AuNP/c1-19(2,3)17-16-10-8-15(9-11-16)14-6-4-13(12-18)5-7-14/h4-7,10H,8-9,11H2,1-3H3
39 atoms
Au 0.033396 -1.897897 0.151567
C  1.314232 0.542077 1.307276
C  0.145516 -0.046054 1.064707
C  0.227329 2.57518 1.771499
C  1.473838 1.891396 2.08597
H  1.540971 1.675211 3.153227
C  -1.138248 0.635333 1.419168
H  -1.820737 -0.025345 1.957234
H  -1.646781 0.950407 0.503702
C  -0.945812 1.925055 2.332249
P  -0.096387 -3.968587 -0.856557
C  0.312617 -3.958005 -2.621807
C  1.013645 -5.208681 -0.139485
H  2.266648 0.138262 0.978639
C  -1.740815 -4.725263 -0.773308
H  -2.466114 -4.0735 -1.264216
H  -1.734922 -5.699749 -1.267381
H  -2.031592 -4.849081 0.271664
H  -0.372534 -3.29211 -3.149944
H  0.231794 -4.966022 -3.035465
H  1.331839 -3.590568 -2.756289
H  2.046473 -4.865947 -0.227103
H  0.90174 -6.163107 -0.659406
H  0.776658 -5.340755 0.917984
H  2.371068 2.406492 1.756936
H  -1.861879 2.506651 2.291133
H  -0.742591 1.577176 3.344397
C  0.13436 3.640544 0.799927
C  -1.036159 4.412187 0.707738
C  1.207556 3.910314 -0.068781
C  -1.132578 5.431282 -0.220477
H  -1.863037 4.242406 1.383183
C  1.106672 4.907517 -1.015973
H  2.111715 3.318513 -0.027112
C  -0.062628 5.667702 -1.081336
H  -2.026412 6.038971 -0.282767
H  1.923088 5.105873 -1.698721
C  -0.163058 6.7244 -2.058219
N  -0.242211 7.565363 -2.83707
elementType: Au C H P N
totalener: -1154.01806793094897 hartree
nucrepener: 1561.39861392924809 hartree
electener: -2715.32454784496031 hartree
oneelecener: -4707.03192734355889 hartree
twoeener: 1991.70737949859858 hartree
cpcmener: -0.08637712941395 hartree
kineticenergy: 1059.90473590077818 hartree
exchangeener: -88.699721599877 hartree
energy: -2098.2864 -392.9352 -282.9593 -281.9018 -281.4240 -281.2675 -281.0281 -281.0040 -280.8687 -280.8643 -280.5240 -280.4983 -280.4262 -280.1142 -279.7685 -279.6984 -279.6960 -279.6941 -182.0627 -131.8029 -131.8024 -131.7576 -116.3951 -67.0719 -66.6869 -66.6811 -29.3465 -28.8697 -27.9627 -26.0193 -25.4134 -25.2059 -24.7535 -24.4357 -22.8516 -22.8480 -22.3307 -21.5680 -20.8400 -19.8101 -19.3637 -18.6466 -18.3313 -17.2471 -17.1322 -16.4342 -15.8715 -15.8097 -15.7273 -15.5189 -15.2272 -15.1465 -15.1394 -15.0389 -14.8173 -14.4329 -14.3000 -14.2903 -14.0413 -13.8802 -13.8081 -13.7052 -13.6015 -13.3855 -13.1078 -12.8618 -12.6554 -12.5993 -12.3125 -11.7830 -11.3564 -11.3239 -11.2995 -10.9708 -10.7432 -9.9646 -9.6592 -9.2708 -2.1893 0.7470 0.8535 1.0192 1.1357 1.2356 1.5555 1.7411 1.9003 2.0652 2.2091 electronvolt
chargesum: 1.0000000
charge: -0.433281 -0.259868 -0.118020 0.577816 0.204808 0.165337 0.252298 0.091514 0.132999 0.113807 0.298263 -0.424314 -0.430048 0.015786 -0.422044 0.137176 0.162904 0.137111 0.135262 0.162437 0.137473 0.137901 0.163718 0.134670 0.097240 -0.010515 0.175435 0.199199 0.051212 -0.045356 -0.407083 0.017462 -0.429779 0.018949 0.857324 0.037972 0.029139 -0.397312 -0.267593
charge: 0.568612 -0.036724 -0.341826 0.012672 0.056694 0.045217 -0.027003 0.010375 0.020012 0.083805 0.715017 -0.027121 -0.026738 -0.015711 -0.026650 -0.047187 -0.038217 -0.047090 -0.047256 -0.038238 -0.047068 -0.046976 -0.038277 -0.047181 0.020465 0.021336 0.048321 -0.088680 0.123884 0.122380 0.097121 0.024796 0.097046 0.027924 -0.158627 0.035550 0.035371 -0.152011 0.131981
qa: -0.4333 -0.2599 -0.1180 0.5778 0.2048 0.1653 0.2523 0.0915 0.1330 0.1138 0.2983 -0.4243 -0.4300 0.0158 -0.4220 0.1372 0.1629 0.1371 0.1353 0.1624 0.1375 0.1379 0.1637 0.1347 0.0972 -0.0105 0.1754 0.1992 0.0512 -0.0454 -0.4071 0.0175 -0.4298 0.0189 0.8573 0.0380 0.0291 -0.3973 -0.2676
va: 1.6883 3.4829 2.6316 2.4938 3.6453 0.8819 3.7205 1.0782 1.0423 4.2344 3.6698 4.0645 4.0606 1.0149 4.0285 1.0863 1.0830 1.0878 1.0905 1.0825 1.0858 1.0829 1.0833 1.0919 0.9688 1.0518 0.8969 1.8788 2.8371 2.8371 2.9271 0.9362 2.9929 0.9708 2.3914 1.0172 1.0239 2.7041 2.4519
dispersion: -0.108097838 hartree
energy: -1154.126165768510 hartree
dipole: -3.675061003 3.583229549 -0.091831454 255.265384701 -255.601110662 -0.335725961 -17.626141998 19.667903680 2.041761683
dipolemethod: SCF
magnitude: 2.071215997 au
magnitude: 5.264612679 debye
