program: Orca
programVersion: 6.1.x
elementType: Au C C C C H C H H C P C C H C H H H H H H H H H H H H C C C C H C H C H H N O O
elementType: Au
charge: 1
multiplicity: 1
keywords: wb97x-d3bj def2-TZVPPD def2/J defgrid3 verytightscf
formula: C15H20AuNO2P
InChI: InChI=1/C12H11NO2.C3H9P.Au/c14-13(15)12-8-6-11(7-9-12)10-4-2-1-3-5-10;1-4(2)3;/h2,6-9H,3-5H2;1-3H3;/rC15H20AuNO2P/c1-20(2,3)16-14-8-4-12(5-9-14)13-6-10-15(11-7-13)17(18)19/h6-8,10-11H,4-5,9H2,1-3H3
40 atoms
Au 0.035701 -2.18011 0.161418
C  1.32818 0.21274 1.396145
C  0.158522 -0.385558 1.181734
C  0.265826 2.17909 1.999116
C  1.512246 1.494176 2.288226
H  1.577819 1.194346 3.33357
C  -1.117685 0.243445 1.638562
H  -1.750232 -0.454355 2.190539
H  -1.684258 0.571964 0.762807
C  -0.90303 1.520659 2.562881
P  -0.110383 -4.186945 -0.966419
C  1.07377 -4.361454 -2.326609
C  0.178603 -5.63913 0.078246
H  2.264837 -0.126528 0.965571
C  -1.727997 -4.484273 -1.726689
H  -1.944765 -3.689429 -2.442964
H  -1.73409 -5.448485 -2.240512
H  -2.49893 -4.479575 -0.953651
H  0.91236 -3.564455 -3.05498
H  0.948776 -5.331127 -2.814387
H  2.090032 -4.279343 -1.936367
H  1.176874 -5.578781 0.516002
H  0.095459 -6.553833 -0.513503
H  -0.557205 -5.659385 0.884553
H  2.411336 2.023333 1.988679
H  -1.81635 2.107586 2.543931
H  -0.686435 1.163606 3.56907
C  0.162978 3.263342 1.041369
C  -1.009212 4.03115 0.970768
C  1.230286 3.552836 0.173841
C  -1.116035 5.068651 0.060799
H  -1.832989 3.846136 1.645692
C  1.124539 4.570892 -0.752445
H  2.136157 2.962676 0.198385
C  -0.047849 5.310023 -0.783169
H  -2.009092 5.675301 0.008021
H  1.933154 4.79124 -1.4351
N  -0.160284 6.415403 -1.765104
O  -1.212414 7.019904 -1.8151
O  0.806249 6.65052 -2.461911
elementType: Au C H P N O
totalener: -1266.33237580713194 hartree
nucrepener: 1740.34398152521271 hartree
electener: -3006.58615605028899 hartree
oneelecener: -5218.76018117934382 hartree
twoeener: 2212.17402512905483 hartree
cpcmener: -0.08353681365026 hartree
kineticenergy: 1171.88280229668271 hartree
exchangeener: -96.740517434803 hartree
energy: -2098.3041 -524.5407 -524.5386 -399.5853 -282.9823 -282.2323 -281.3192 -281.0565 -281.0274 -280.8885 -280.8822 -280.5771 -280.5061 -280.4483 -280.2260 -279.8708 -279.7079 -279.7060 -279.7048 -182.0805 -131.8205 -131.8202 -131.7758 -116.4264 -67.1049 -66.7188 -66.7116 -38.1861 -33.2705 -29.0824 -28.1874 -26.4323 -25.4637 -25.2200 -24.8581 -24.7101 -23.2855 -22.8621 -22.8582 -21.6169 -20.9678 -20.8029 -19.6478 -19.4079 -18.8096 -18.6650 -18.4546 -18.1012 -17.1975 -17.0338 -16.5060 -15.9557 -15.9008 -15.7751 -15.5646 -15.2972 -15.1570 -15.1544 -14.8961 -14.6295 -14.4721 -14.3102 -14.3003 -14.0610 -13.8173 -13.6299 -13.4669 -13.1991 -12.6728 -12.6139 -12.3516 -12.2711 -12.2250 -11.8937 -11.8161 -11.3895 -11.3595 -11.3348 -11.3134 -10.7557 -9.9870 -9.7555 -9.2991 -2.2508 -0.2832 0.7257 0.9506 1.1241 1.2474 1.5439 1.6962 1.8307 1.9249 2.0702 electronvolt
chargesum: 1.0000000
charge: -0.410865 -0.191970 -0.180432 0.603385 0.235704 0.159115 0.223371 0.093563 0.123827 0.100424 0.312395 -0.424945 -0.424962 0.039144 -0.429378 0.136128 0.164741 0.136938 0.135606 0.162736 0.138668 0.134638 0.163446 0.135878 0.086508 -0.000650 0.177935 0.233708 -0.200632 -0.295433 -0.030477 0.007422 -0.145106 -0.001140 0.075150 0.049597 0.039700 0.929750 -0.532413 -0.531075
charge: 0.572083 -0.029673 -0.335233 0.010400 0.061220 0.043594 -0.025246 0.011219 0.020093 0.085049 0.715648 -0.026215 -0.026678 -0.012562 -0.026567 -0.047055 -0.038078 -0.047029 -0.046966 -0.038066 -0.046779 -0.047003 -0.038096 -0.046987 0.023059 0.021141 0.047492 -0.085927 0.129021 0.126091 0.121759 0.025645 0.121128 0.029452 -0.075520 0.028426 0.028166 -0.333452 0.076138 0.076311
qa: -0.4109 -0.1920 -0.1804 0.6034 0.2357 0.1591 0.2234 0.0936 0.1238 0.1004 0.3124 -0.4249 -0.4250 0.0391 -0.4294 0.1361 0.1647 0.1369 0.1356 0.1627 0.1387 0.1346 0.1634 0.1359 0.0865 -0.0006 0.1779 0.2337 -0.2006 -0.2954 -0.0305 0.0074 -0.1451 -0.0011 0.0751 0.0496 0.0397 0.9297 -0.5324 -0.5311
va: 1.7150 3.4811 2.7840 2.4513 3.5219 0.8905 3.7917 1.0758 1.0523 4.3439 3.6770 4.0436 4.0694 0.9886 4.0452 1.0883 1.0814 1.0858 1.0900 1.0839 1.0819 1.0906 1.0820 1.0899 0.9777 1.0432 0.8875 1.7080 3.2979 3.3385 3.0994 0.9383 3.1876 0.9913 3.1782 0.9662 0.9779 3.6772 1.7360 1.7384
dispersion: -0.109333677 hartree
energy: -1266.441709483717 hartree
dipole: -4.148513848 4.128239606 -0.020274242 291.347385660 -292.546693214 -1.199307554 -18.831459318 21.063384928 2.231925610
dipolemethod: SCF
magnitude: 2.533819564 au
magnitude: 6.440457501 debye
