program: Orca
programVersion: 6.1.x
elementType: Au C C C C H C H H C P C C H C H H H H H H H H H H H H C C C C H C H C F F F
elementType: Au
charge: 1
multiplicity: 1
keywords: wb97x-d3bj def2-TZVPPD def2/J defgrid3 verytightscf
formula: C15H18F3AuP
InChI: InChI=1/C12H9F3.C3H9P.Au/c13-10-6-9(7-11(14)12(10)15)8-4-2-1-3-5-8;1-4(2)3;/h2,6-7H,3-5H2;1-3H3;/rC15H18AuF3P/c1-20(2,3)16-12-6-4-10(5-7-12)11-8-13(17)15(19)14(18)9-11/h6,8-9H,4-5,7H2,1-3H3
38 atoms
Au -0.042704 -2.114638 0.180767
C  1.52301 0.30433 0.954201
C  0.32283 -0.267457 1.034438
C  0.627708 2.371884 1.63327
C  1.903537 1.664059 1.625612
H  2.253736 1.476853 2.641838
C  -0.810585 0.436554 1.71538
H  -1.319529 -0.211208 2.432001
H  -1.551873 0.736145 0.968447
C  -0.362099 1.735813 2.498666
P  -0.432337 -4.177267 -0.776965
C  0.680262 -4.568235 -2.152992
C  -0.248445 -5.569482 0.368666
H  2.347439 -0.12368 0.392755
C  -2.096229 -4.372167 -1.467978
H  -2.261633 -3.614815 -2.236693
H  -2.210361 -5.366427 -1.906392
H  -2.836543 -4.236606 -0.677143
H  0.567948 -3.815528 -2.935762
H  0.447492 -5.554741 -2.560874
H  1.713318 -4.555333 -1.800148
H  0.765685 -5.576306 0.772813
H  -0.441069 -6.513301 -0.14703
H  -0.95389 -5.455529 1.194001
H  2.690647 2.137099 1.047392
H  -1.235855 2.340054 2.723237
H  0.118174 1.410896 3.421436
C  0.298622 3.42302 0.712414
C  -1.018423 3.919446 0.654376
C  1.277165 3.946387 -0.155365
C  -1.332965 4.897727 -0.253859
H  -1.803039 3.554562 1.30193
C  0.931036 4.925204 -1.051036
H  2.302896 3.606539 -0.143353
C  -0.369851 5.412083 -1.113973
F  -2.575363 5.386556 -0.33583
F  -0.685916 6.360941 -1.979204
F  1.836579 5.442608 -1.88861
elementType: Au C H P F
totalener: -1359.55544129728764 hartree
nucrepener: 1790.58015587540808 hartree
electener: -3150.05153398414177 hartree
oneelecener: -5455.07696713220412 hartree
twoeener: 2305.02543314806235 hartree
cpcmener: -0.07935375965844 hartree
kineticenergy: 1264.90797715778922 hartree
exchangeener: -101.746181144487 hartree
energy: -2098.2723 -675.7050 -675.2715 -675.2672 -283.7052 -283.2572 -283.2560 -282.9636 -281.4875 -281.2595 -281.2514 -280.5202 -280.4623 -280.3412 -280.0648 -279.7337 -279.6897 -279.6882 -279.6876 -182.0489 -131.7890 -131.7887 -131.7435 -116.3724 -67.0481 -66.6639 -66.6583 -38.8079 -38.1687 -38.0424 -29.1781 -28.0380 -25.9129 -25.6674 -25.1957 -24.7468 -24.3312 -22.8419 -22.8415 -22.3436 -22.1613 -21.1172 -20.3442 -19.7754 -19.2607 -18.9085 -18.6134 -18.1002 -18.0077 -17.8833 -17.2025 -16.9687 -16.6550 -16.5729 -16.1528 -15.8906 -15.7077 -15.6173 -15.3742 -15.1379 -15.1360 -15.0062 -14.5929 -14.4122 -14.3014 -14.2865 -14.2191 -14.1675 -13.8006 -13.7999 -13.5777 -13.1728 -12.6434 -12.5919 -12.3171 -11.7532 -11.3350 -11.3047 -11.2807 -10.9379 -10.6094 -9.9492 -9.6164 -9.2560 -2.0941 0.8805 0.9666 1.0986 1.1545 1.4576 1.6279 1.7843 1.8176 2.1161 2.2381 electronvolt
chargesum: 1.0000000
charge: -0.442118 -0.241298 -0.091154 0.651317 0.320517 0.139752 0.267188 0.074747 0.121575 0.004779 0.302155 -0.427525 -0.422290 0.034173 -0.429372 0.135497 0.163514 0.137162 0.136065 0.163972 0.138124 0.134418 0.164117 0.135510 0.007135 0.007143 0.197940 0.241668 -0.607479 -0.564378 0.476538 -0.033984 0.553386 -0.072845 0.479384 -0.299808 -0.258151 -0.297372
charge: 0.566452 -0.037366 -0.341988 0.016079 0.058850 0.045277 -0.033947 0.010342 0.017641 0.076097 0.714729 -0.027028 -0.027229 -0.017626 -0.027014 -0.047296 -0.038342 -0.047177 -0.047266 -0.038394 -0.047092 -0.047264 -0.038343 -0.047252 0.015056 0.022582 0.047913 -0.083703 0.181758 0.183487 -0.157439 0.039810 -0.157835 0.038554 -0.103270 0.111862 0.154625 0.111754
qa: -0.4421 -0.2413 -0.0912 0.6513 0.3205 0.1398 0.2672 0.0747 0.1216 0.0048 0.3022 -0.4275 -0.4223 0.0342 -0.4294 0.1355 0.1635 0.1372 0.1361 0.1640 0.1381 0.1344 0.1641 0.1355 0.0071 0.0071 0.1979 0.2417 -0.6075 -0.5644 0.4765 -0.0340 0.5534 -0.0728 0.4794 -0.2998 -0.2582 -0.2974
va: 1.6848 3.4409 2.6377 2.4069 3.7403 0.8950 3.7550 1.0979 1.0488 4.0295 3.6689 4.0429 4.0631 0.9958 4.0499 1.0902 1.0829 1.0863 1.0896 1.0829 1.0833 1.0923 1.0814 1.0900 0.9762 1.0679 0.8562 1.5486 3.9992 3.8601 3.1333 0.9824 2.9983 1.0268 3.2960 1.0489 1.0872 1.0461
dispersion: -0.104185802 hartree
energy: -1359.659627099556 hartree
dipole: -2.935833420 3.246712808 0.310879388 268.648639741 -268.747561650 -0.098921910 -19.373946058 20.838090205 1.464144147
dipolemethod: SCF
magnitude: 1.500049873 au
magnitude: 3.812823768 debye
