program: Orca
programVersion: 6.1.x
elementType: Au C C C C H C H H C P C C H C H H H H H H H H H H H H C C C C H C H C H H C N
elementType: Au
charge: 1
multiplicity: 1
keywords: wb97x-d3bj def2-TZVPPD def2/J defgrid3 verytightscf
formula: C16H20AuNP
InChI: InChI=1/C13H11N.C3H9P.Au/c14-10-11-6-8-13(9-7-11)12-4-2-1-3-5-12;1-4(2)3;/h2,6-9H,3-5H2;1-3H3;/rC16H20AuNP/c1-19(2,3)17-16-10-8-15(9-11-16)14-6-4-13(12-18)5-7-14/h4-7,10H,8-9,11H2,1-3H3
39 atoms
Au -0.1527 -1.885464 0.133235
C  1.046904 0.510578 1.459031
C  -0.100498 -0.043192 1.070805
C  0.019282 2.570675 1.771289
C  1.15697 1.835289 2.29492
H  1.047233 1.60134 3.353875
C  -1.401375 0.666152 1.27442
H  -2.145637 0.02672 1.753248
H  -1.803884 0.954271 0.298862
C  -1.267346 1.985697 2.137512
P  -0.234903 -3.945528 -0.901836
C  0.028868 -3.884453 -2.693418
C  0.998437 -5.127747 -0.298064
H  2.020671 0.095788 1.219978
C  -1.820711 -4.799591 -0.702871
H  -2.619932 -4.185493 -1.122318
H  -1.797544 -5.765062 -1.213855
H  -2.018827 -4.955112 0.359408
H  -0.734459 -3.252554 -3.151552
H  -0.027178 -4.889222 -3.118912
H  1.010812 -3.455346 -2.902017
H  1.999546 -4.723559 -0.460092
H  0.900682 -6.079565 -0.825549
H  0.854286 -5.288544 0.772069
H  2.125373 2.285573 2.099408
H  -2.122797 2.631213 1.959301
H  -1.234488 1.68356 3.184613
C  0.147089 3.630659 0.798483
C  -0.950172 3.981641 -0.007881
C  1.364011 4.315828 0.642886
C  -0.829385 4.971094 -0.962209
H  -1.894633 3.464577 0.094146
C  1.484369 5.324061 -0.293039
H  2.211892 4.081424 1.271388
C  0.38801 5.640061 -1.094861
H  -1.666353 5.233371 -1.59684
H  2.415191 5.865079 -0.407063
C  0.513065 6.687654 -2.078736
N  0.611441 7.522044 -2.862445
elementType: Au C H P N
totalener: -1154.01861223009155 hartree
nucrepener: 1561.97470801518102 hartree
electener: -2715.90129067741054 hartree
oneelecener: -4708.16744207212832 hartree
twoeener: 1992.26615139471755 hartree
cpcmener: -0.08632014472843 hartree
kineticenergy: 1059.90673936580265 hartree
exchangeener: -88.700293685556 hartree
energy: -2098.2911 -392.9348 -282.9194 -281.9028 -281.4230 -281.2415 -281.0074 -281.0059 -280.8655 -280.8614 -280.5474 -280.4472 -280.3686 -280.1747 -279.8284 -279.7002 -279.6998 -279.6970 -182.0676 -131.8078 -131.8073 -131.7626 -116.4068 -67.0841 -66.6990 -66.6920 -29.3444 -28.8577 -27.9545 -26.0178 -25.4107 -25.2099 -24.7638 -24.4228 -22.8538 -22.8520 -22.3247 -21.5570 -20.8641 -19.7904 -19.3573 -18.6488 -18.3207 -17.3059 -17.0258 -16.4514 -15.8606 -15.8167 -15.6401 -15.5789 -15.2426 -15.1524 -15.1466 -15.0306 -14.8701 -14.4385 -14.3025 -14.2951 -14.0407 -13.8688 -13.8109 -13.6737 -13.5766 -13.4054 -13.0854 -12.8517 -12.6557 -12.6034 -12.3027 -11.7803 -11.3652 -11.3364 -11.3116 -10.9556 -10.7315 -9.9726 -9.7183 -9.2804 -2.1725 0.7584 0.8436 1.0467 1.1315 1.2366 1.5572 1.7454 1.8920 2.0881 2.1718 electronvolt
chargesum: 1.0000000
charge: -0.437270 -0.156574 -0.189248 0.561779 0.320973 0.116581 0.230750 0.074181 0.133215 -0.026767 0.302291 -0.425189 -0.429809 0.052763 -0.420421 0.137359 0.164016 0.136044 0.135336 0.162572 0.136869 0.138480 0.162877 0.134236 0.050011 0.064614 0.194491 0.181103 0.039335 0.074700 -0.511057 0.029960 -0.430666 0.021452 0.872119 0.021893 0.039981 -0.394744 -0.268235
charge: 0.570547 -0.027604 -0.336180 0.011871 0.061702 0.044680 -0.034772 0.010759 0.014130 0.075179 0.715391 -0.026978 -0.026417 -0.015171 -0.026676 -0.047183 -0.038151 -0.047092 -0.047201 -0.038168 -0.047024 -0.046866 -0.038182 -0.047077 0.017688 0.027559 0.047889 -0.089468 0.122131 0.123086 0.097857 0.025811 0.096742 0.025078 -0.158564 0.035371 0.035377 -0.152105 0.132031
qa: -0.4373 -0.1566 -0.1892 0.5618 0.3210 0.1166 0.2307 0.0742 0.1332 -0.0268 0.3023 -0.4252 -0.4298 0.0528 -0.4204 0.1374 0.1640 0.1360 0.1353 0.1626 0.1369 0.1385 0.1629 0.1342 0.0500 0.0646 0.1945 0.1811 0.0393 0.0747 -0.5111 0.0300 -0.4307 0.0215 0.8721 0.0219 0.0400 -0.3947 -0.2682
va: 1.7000 3.3582 2.7225 2.3947 3.8657 0.9361 3.8254 1.1166 1.0405 3.9739 3.6770 4.0708 4.0551 0.9734 4.0266 1.0872 1.0828 1.0905 1.0903 1.0820 1.0873 1.0805 1.0840 1.0920 0.9914 1.0491 0.8710 1.9746 2.7695 2.8619 2.9791 0.9569 2.9484 0.9458 2.3649 1.0323 1.0158 2.7090 2.4509
dispersion: -0.108146114 hartree
energy: -1154.126758344521 hartree
dipole: 13.179569222 -13.587232564 -0.407663342 254.200191131 -254.578051052 -0.377859921 -17.829663523 19.819410017 1.989746494
dipolemethod: SCF
magnitude: 2.065928032 au
magnitude: 5.251171739 debye
