program: Orca
programVersion: 6.1.x
elementType: Au C C C C H C H H C P C C H C H H H H H H H H H H H H C C C C H C H C H H H
elementType: Au
keywords: optts freq wb97x-d3bj def2-tzvp(-f) def2/J tightopt verytightscf
charge: 1
multiplicity: 1
frequency: 0.00 0.00 0.00 0.00 0.00 0.00 -380.71 14.58 20.10 33.48 42.54 51.29 102.50 120.80 141.38 158.46 176.18 181.59 185.98 193.57 216.85 223.59 224.40 237.09 255.90 259.40 323.93 372.12 372.66 389.30 420.12 451.59 512.76 541.92 635.40 636.30 682.79 688.96 707.12 720.29 752.63 778.71 779.56 791.54 809.97 832.59 869.42 874.53 874.97 880.42 883.38 908.25 967.36 974.61 975.25 980.31 994.49 1005.47 1016.11 1021.32 1030.45 1031.26 1047.24 1067.97 1117.83 1140.43 1174.56 1195.55 1209.43 1220.18 1300.04 1315.26 1332.61 1337.51 1338.10 1350.44 1366.32 1391.89 1443.72 1445.43 1447.45 1447.98 1454.36 1454.39 1461.65 1462.88 1494.87 1506.84 1554.02 1643.24 1669.38 1686.30 1835.89 3074.00 3074.71 3074.94 3097.72 3115.47 3152.81 3164.70 3165.14 3165.92 3172.14 3172.25 3172.50 3173.22 3175.68 3203.52 3211.29 3220.19 3227.18 3232.05 3267.09 3368.67
frequency: 14.58 20.10 33.48 42.54 51.29 102.50 120.80 141.38 158.46 176.18 181.59 185.98 193.57 216.85 223.59 224.40 237.09 255.90 259.40 323.93 372.12 372.66 389.30 420.12 451.59 512.76 541.92 635.40 636.30 682.79 688.96 707.12 720.29 752.63 778.71 779.56 791.54 809.97 832.59 869.42 874.53 874.97 880.42 883.38 908.25 967.36 974.61 975.25 980.31 994.49 1005.47 1016.11 1021.32 1030.45 1031.26 1047.24 1067.97 1117.83 1140.43 1174.56 1195.55 1209.43 1220.18 1300.04 1315.26 1332.61 1337.51 1338.10 1350.44 1366.32 1391.89 1443.72 1445.43 1447.45 1447.98 1454.36 1454.39 1461.65 1462.88 1494.87 1506.84 1554.02 1643.24 1669.38 1686.30 1835.89 3074.00 3074.71 3074.94 3097.72 3115.47 3152.81 3164.70 3165.14 3165.92 3172.14 3172.25 3172.50 3173.22 3175.68 3203.52 3211.29 3220.19 3227.18 3232.05 3267.09 3368.67
formula: C15H21AuP
InChI: InChI=1/C12H12.C3H9P.Au/c1-3-4-8-11(2)12-9-6-5-7-10-12;1-4(2)3;/h1,5-7,9-10H,2,4,8H2;1-3H3;/rC15H21AuP/c1-13(15-9-7-6-8-10-15)11-12-14(2)16-17(3,4)5/h2,6-10H,1,11-12H2,3-5H3
38 atoms
Au 0.109741 -1.449249 0.069954
C  1.305236 0.918045 0.649738
C  0.120222 0.520792 0.827271
C  0.457904 3.174597 1.327634
C  1.747897 2.872338 1.615006
H  1.996962 2.370525 2.543002
C  -1.070218 1.219901 1.368167
H  -1.644313 0.583272 2.04197
H  -1.72032 1.477422 0.52766
C  -0.61434 2.510661 2.117623
P  -0.037378 -3.596184 -0.716686
C  1.570724 -4.371079 -1.008152
C  -0.906359 -4.708279 0.414133
H  2.301847 0.836793 0.256196
C  -0.92213 -3.724859 -2.288675
H  -0.409199 -3.127863 -3.04482
H  -0.959826 -4.768255 -2.610428
H  -1.937662 -3.343937 -2.166196
H  2.12589 -3.789462 -1.746256
H  1.430987 -5.39021 -1.376492
H  2.138445 -4.394635 -0.076304
H  -0.378601 -4.740647 1.368976
H  -0.951045 -5.712947 -0.012776
H  -1.919301 -4.338073 0.582151
H  2.568544 3.286711 1.040243
H  -1.49087 3.144465 2.249468
H  -0.231624 2.22722 3.098204
C  0.086124 3.981545 0.138742
C  -1.050692 4.792404 0.158954
C  0.867509 3.948788 -1.020538
C  -1.387772 5.565095 -0.945547
H  -1.667584 4.843795 1.048209
C  0.523729 4.711555 -2.126693
H  1.738923 3.305539 -1.065937
C  -0.604008 5.525786 -2.091736
H  -2.267171 6.198828 -0.908154
H  1.135118 4.666665 -3.021499
H  -0.87154 6.123749 -2.956213
totalener: -1061.67118290289181 hartree
nucrepener: 1387.26162603069361 hartree
electener: -2448.85413555377818 hartree
oneelecener: -4237.57832556930134 hartree
twoeener: 1788.72419001552294 hartree
cpcmener: -0.07223838631013 hartree
kineticenergy: 967.67120950756964 hartree
exchangeener: -80.660782872993 hartree
dispersion: -0.103230276 hartree
temp: 298.15 k
press: 1.00 atm
thermalcorrenthalpy: 0.00094421 hartree
totalenthalpy: -1061.43672024 hartree
vibrat: 0.02756037 hartree
rotat: 0.01647156 hartree
transl: 0.02093464 hartree
total: 0.06496657 hartree
totalentropycorr: -0.06496657 hartree
gibbsenthalpy: -1061.50168680 hartree
gibbsminuselec: 0.27272638 hartree
dispersion: -0.104326025 hartree
dispersion: -0.104336091 hartree
dispersion: -0.104347287 hartree
dispersion: -0.104345362 hartree
dispersion: -0.104345108 hartree
dispersion: -0.104345886 hartree
dispersion: -0.104346431 hartree
elementType: Au C H P
energy: -2098.6471 -281.4992 -281.0660 -280.5537 -280.5133 -280.3675 -280.1973 -280.0974 -280.0054 -280.0006 -279.9263 -279.9048 -279.8959 -279.8556 -279.8495 -279.8477 -182.4219 -132.1576 -132.1574 -132.1248 -116.8452 -67.6114 -67.1256 -67.1025 -27.9831 -27.1332 -25.6518 -25.4209 -24.5065 -24.2483 -23.9972 -23.0171 -23.0143 -21.5961 -20.7223 -20.1720 -19.0918 -18.8316 -18.4770 -17.4674 -16.4875 -16.3820 -16.2273 -15.8228 -15.6670 -15.3652 -15.3167 -15.2843 -15.2553 -14.8047 -14.4987 -14.4414 -14.4237 -13.9412 -13.8936 -13.6678 -13.3811 -13.2596 -12.9478 -12.8519 -12.4939 -12.3515 -12.2474 -12.0539 -11.7551 -11.7319 -11.5788 -10.7481 -10.5063 -10.2303 -9.9135 -9.1692 -0.3922 0.8257 1.1059 1.4481 1.6884 2.1818 2.3629 2.7700 3.0817 3.4724 3.5640 electronvolt
chargesum: 1.0000000
charge: 0.125298 -0.181234 -0.047410 0.214886 -0.329643 0.166355 -0.201267 0.163492 0.159313 -0.264826 0.661986 -0.591019 -0.588863 0.226667 -0.584826 0.178350 0.168630 0.178350 0.178083 0.169606 0.178510 0.178954 0.169128 0.178616 0.171784 0.160315 0.143855 0.286723 -0.303887 -0.267350 -0.123131 0.135921 -0.130299 0.140888 -0.108982 0.128858 0.127718 0.130452
charge: 0.275574 0.016265 -0.313806 -0.089980 -0.109320 0.140761 -0.184423 0.148463 0.155204 -0.155509 0.641332 -0.432176 -0.432291 0.160267 -0.432441 0.126349 0.121569 0.126480 0.126346 0.121723 0.126379 0.126486 0.121633 0.126425 0.133613 0.146675 0.145766 -0.104901 -0.089339 -0.088704 -0.128980 0.147773 -0.128601 0.148341 -0.123961 0.143828 0.143760 0.143422
qa: 0.1253 -0.1812 -0.0474 0.2149 -0.3296 0.1664 -0.2013 0.1635 0.1593 -0.2648 0.6620 -0.5910 -0.5889 0.2267 -0.5848 0.1783 0.1686 0.1784 0.1781 0.1696 0.1785 0.1790 0.1691 0.1786 0.1718 0.1603 0.1439 0.2867 -0.3039 -0.2673 -0.1231 0.1359 -0.1303 0.1409 -0.1090 0.1289 0.1277 0.1305
va: 1.6440 3.8312 3.7382 3.7269 3.8928 0.9664 3.9587 0.9497 0.9566 3.9708 4.1279 3.8439 3.8424 0.9470 3.8428 0.9538 0.9573 0.9538 0.9543 0.9571 0.9542 0.9533 0.9572 0.9536 0.9602 0.9601 0.9628 3.7344 4.0036 3.9661 3.9036 0.9664 3.9326 0.9688 3.9237 0.9665 0.9675 0.9628
dispersion: -0.104346952 hartree
energy: -1061.776273559550 hartree
dipole: -10.984612282 11.267312199 0.282699916 197.565181623 -198.973921199 -1.408739576 -20.871998280 20.938522677 0.066524398
dipolemethod: SCF
magnitude: 1.438364325 au
magnitude: 3.656031565 debye
zeropoint: 0.31876694 hartree
thermalvibcorrection: 0.01706412 hartree
thermalrotcorrection: 0.00141627 hartree
thermaltrasncorrection: 0.00141627 hartree
thermaltotal: -1061.43760996 hartree
thermalcorr: 0.01989667 hartree
nonthermalcorr: 0.31876694 hartree
totalcorr: 0.33866360 hartree
totalenthalpy: -1061.43666575 hartree
vibrat: 0.03103672 hartree
rotat: 0.01645248 hartree
total: 0.06842384 hartree
